{"text_format":"1","workbook":"xlsx","n_sheets":3,"sheets":["Link-Group","Advanced","Weights"],"not_rendered":{"charts":0,"images":0,"macros":1,"external_links":0,"defined_names":16,"comments":0,"pivot_tables":0},"unopened":[],"bounds":{"document_bytes":16777216,"sheet_cells":100000,"rows_first":2000,"rows_last":500,"rows_between":2000,"halvings":0,"cell_chars":16384,"cell_head_chars":4096},"cells_cut":0,"cells_raw":0,"read":"whole","date_system":"1900"}

{"sheet":"Link-Group","index":0,"n_rows":28,"n_cols":7,"rows_kept":28,"cut":false,"hidden":false,"merged":[]}
["Link-Group","Link-Master","LQ 2","LQ 3","LQ 4","LQ 5","LQ 6"]
["# of 2W",0,0,0,0,0,0]
["# of 4W",8,0,0,0,0,0]
["# of 4WG",0,0,0,0,0,0]
["# of SIP",8,0,0,0,0,0]
["# of IVC",8,0,0,0,0,0]
["# of Virtual Clients",0,0,0,0,0,0]
["Resource Usage",{"$f":"_xlfn.FLOOR.MATH(SUM(B22:B25,B28))","v":58},{"$f":"_xlfn.FLOOR.MATH(SUM(C22:C25,C28))","v":0},0,0,0,0]
["Total Number of Ports",{"$f":"SUM(B2:B7)","v":24},{"$f":"SUM(C2:C7)","v":0},0,0,0,0]
["Total Number of Clients",{"$f":"SUM(B2:G7)","v":24}]
["Total Number of Virtual Clients",{"$f":"SUM(B7:G7)","v":0}]
["Remote Virtual Clients",{"$f":"Total_Number_of_Virtual_Clients-B7","v":0},0,0,0,0,0]
[]
["Instructions:","In the table above, enter the number of ports and virtual clients for each LQ's configuration."]
[null,"Go to the Advanced sheet to edit channel associations and port quality."]
[null,"Select the Link-Group network type below between Internet/Routed and WAN/LAN."]
[]
[]
["Number of Devices in Link-Group",{"$f":"COUNTIF(B9:G9,\">0\")","v":1}]
["Link-Group Network","WAN/LAN",{"$f":"VLOOKUP($B$20,Weights!D2:E3,2)","v":0.8}]
[]
["Outgoing Cost",{"$f":"Advanced!J$65*$C$20","v":0},{"$f":"Advanced!K$65*$C$20","v":0},{"$f":"Advanced!L$65*$C$20","v":0},{"$f":"Advanced!M$65*$C$20","v":0},{"$f":"Advanced!N$65*$C$20","v":0},{"$f":"Advanced!O$65*$C$20","v":0}]
["Incoming Cost",{"$f":"Advanced!R$65*$C$20","v":0},{"$f":"Advanced!S$65*$C$20","v":0},{"$f":"Advanced!T$65*$C$20","v":0},{"$f":"Advanced!U$65*$C$20","v":0},{"$f":"Advanced!V$65*$C$20","v":0},{"$f":"Advanced!W$65*$C$20","v":0}]
["Internal Cost",{"$f":"Advanced!Z$65","v":0},{"$f":"Advanced!AA$65","v":0},{"$f":"Advanced!AB$65","v":0},{"$f":"Advanced!AC$65","v":0},{"$f":"Advanced!AD$65","v":0},{"$f":"Advanced!AE$65","v":0}]
["Virtual Clients Cost",{"$f":"IF(AND($B$11>0,B9>0), B7*1.1+(Number_of_Devices-1)*B$7*Virtual_Client_Routing_Out+Virtual_Client_Routing_In*($B$11-B$7), 0)","v":0},0,0,0,0,0]
["SIP Cost",{"$f":"B5*SIP_Cost","v":40},0,0,0,0,0]
["IVC Cost",{"$f":"B6*IVC_Cost","v":36},0,0,0,0,0]
["SIP and IVC Combined Cost",{"$f":"MIN(B26,B27)*0.5 + MAX(B26,B27)","v":58},{"$f":"MIN(C26,C27)*0.5 + MAX(C26,C27)","v":0},0,0,0,0]

{"sheet":"Advanced","index":1,"n_rows":65,"n_cols":31,"rows_kept":65,"cut":false,"hidden":false,"merged":[]}
["Port Network Quality",null,"Associate each port to a channel as it would be used in the system. If a port is unassigned, leave the channel field blank. Channel name matching is case sensitive."]
[]
["Port Number","Link-Master","Quality","Channel","LQ 2","Quality","Channel","LQ 3","Quality","Channel","LQ 4","Quality","Channel","LQ 5","Quality","Channel","LQ 6","Quality","Channel"]
[1,{"$f":"IF($A4-1 < 'Link-Group'!B$2, \"2W\", IF($A4-1 < 'Link-Group'!B$2+'Link-Group'!B$3, \"4W\", IF($A4-1 < SUM('Link-Group'!B$2:'Link-Group'!B$4), \"4WG\", IF($A4-1 < SUM('Link-Group'!B$2:'Link-Group'!B$5), \"SIP\", IF($A4-1 < SUM('Link-Group'!B$2:'Link-Group'!B$6), \"IVC\", \"\")))))","v":"4W"},"High",null,{"$f":"IF($A4-1 < 'Link-Group'!C$2, \"2W\", IF($A4-1 < 'Link-Group'!C$2+'Link-Group'!C$3, \"4W\", IF($A4-1 < SUM('Link-Group'!C$2:'Link-Group'!C$4), \"4WG\", IF($A4-1 < SUM('Link-Group'!C$2:'Link-Group'!C$5), \"SIP\", IF($A4-1 < SUM('Link-Group'!C$2:'Link-Group'!C$6), \"IVC\", \"\")))))","v":""},"High",null,{"$f":"IF($A4-1 < 'Link-Group'!D$2, \"2W\", IF($A4-1 < 'Link-Group'!D$2+'Link-Group'!D$3, \"4W\", IF($A4-1 < SUM('Link-Group'!D$2:'Link-Group'!D$4), \"4WG\", IF($A4-1 < SUM('Link-Group'!D$2:'Link-Group'!D$5), \"SIP\", IF($A4-1 < SUM('Link-Group'!D$2:'Link-Group'!D$6), \"IVC\", \"\")))))","v":""},"High",null,{"$f":"IF($A4-1 < 'Link-Group'!E$2, \"2W\", IF($A4-1 < 'Link-Group'!E$2+'Link-Group'!E$3, \"4W\", IF($A4-1 < SUM('Link-Group'!E$2:'Link-Group'!E$4), \"4WG\", IF($A4-1 < SUM('Link-Group'!E$2:'Link-Group'!E$5), \"SIP\", IF($A4-1 < SUM('Link-Group'!E$2:'Link-Group'!E$6), \"IVC\", \"\")))))","v":""},"High",1,{"$f":"IF($A4-1 < 'Link-Group'!F$2, \"2W\", IF($A4-1 < 'Link-Group'!F$2+'Link-Group'!F$3, \"4W\", IF($A4-1 < SUM('Link-Group'!F$2:'Link-Group'!F$4), \"4WG\", IF($A4-1 < SUM('Link-Group'!F$2:'Link-Group'!F$5), \"SIP\", IF($A4-1 < SUM('Link-Group'!F$2:'Link-Group'!F$6), \"IVC\", \"\")))))","v":""},"High",null,{"$f":"IF($A4-1 < 'Link-Group'!G$2, \"2W\", IF($A4-1 < 'Link-Group'!G$2+'Link-Group'!G$3, \"4W\", IF($A4-1 < SUM('Link-Group'!G$2:'Link-Group'!G$4), \"4WG\", IF($A4-1 < SUM('Link-Group'!G$2:'Link-Group'!G$5), \"SIP\", IF($A4-1 < SUM('Link-Group'!G$2:'Link-Group'!G$6), \"IVC\", \"\")))))","v":""},"High"]
[2,{"$f":"IF($A5-1 < 'Link-Group'!B$2, \"2W\", IF($A5-1 < 'Link-Group'!B$2+'Link-Group'!B$3, \"4W\", IF($A5-1 < SUM('Link-Group'!B$2:'Link-Group'!B$4), \"4WG\", IF($A5-1 < SUM('Link-Group'!B$2:'Link-Group'!B$5), \"SIP\", IF($A5-1 < SUM('Link-Group'!B$2:'Link-Group'!B$6), \"IVC\", \"\")))))","v":"4W"},"High",null,{"$f":"IF($A5-1 < 'Link-Group'!C$2, \"2W\", IF($A5-1 < 'Link-Group'!C$2+'Link-Group'!C$3, \"4W\", IF($A5-1 < SUM('Link-Group'!C$2:'Link-Group'!C$4), \"4WG\", IF($A5-1 < SUM('Link-Group'!C$2:'Link-Group'!C$5), \"SIP\", IF($A5-1 < SUM('Link-Group'!C$2:'Link-Group'!C$6), \"IVC\", \"\")))))","v":""},"High",null,{"$f":"IF($A5-1 < 'Link-Group'!D$2, \"2W\", IF($A5-1 < 'Link-Group'!D$2+'Link-Group'!D$3, \"4W\", IF($A5-1 < SUM('Link-Group'!D$2:'Link-Group'!D$4), \"4WG\", IF($A5-1 < SUM('Link-Group'!D$2:'Link-Group'!D$5), \"SIP\", IF($A5-1 < SUM('Link-Group'!D$2:'Link-Group'!D$6), \"IVC\", \"\")))))","v":""},"High",null,{"$f":"IF($A5-1 < 'Link-Group'!E$2, \"2W\", IF($A5-1 < 'Link-Group'!E$2+'Link-Group'!E$3, \"4W\", IF($A5-1 < SUM('Link-Group'!E$2:'Link-Group'!E$4), \"4WG\", IF($A5-1 < SUM('Link-Group'!E$2:'Link-Group'!E$5), \"SIP\", IF($A5-1 < SUM('Link-Group'!E$2:'Link-Group'!E$6), \"IVC\", \"\")))))","v":""},"High",null,{"$f":"IF($A5-1 < 'Link-Group'!F$2, \"2W\", IF($A5-1 < 'Link-Group'!F$2+'Link-Group'!F$3, \"4W\", IF($A5-1 < SUM('Link-Group'!F$2:'Link-Group'!F$4), \"4WG\", IF($A5-1 < SUM('Link-Group'!F$2:'Link-Group'!F$5), \"SIP\", IF($A5-1 < SUM('Link-Group'!F$2:'Link-Group'!F$6), \"IVC\", \"\")))))","v":""},"High",null,{"$f":"IF($A5-1 < 'Link-Group'!G$2, \"2W\", IF($A5-1 < 'Link-Group'!G$2+'Link-Group'!G$3, \"4W\", IF($A5-1 < SUM('Link-Group'!G$2:'Link-Group'!G$4), \"4WG\", IF($A5-1 < SUM('Link-Group'!G$2:'Link-Group'!G$5), \"SIP\", IF($A5-1 < SUM('Link-Group'!G$2:'Link-Group'!G$6), \"IVC\", \"\")))))","v":""},"High"]
[3,{"$f":"IF($A6-1 < 'Link-Group'!B$2, \"2W\", IF($A6-1 < 'Link-Group'!B$2+'Link-Group'!B$3, \"4W\", IF($A6-1 < SUM('Link-Group'!B$2:'Link-Group'!B$4), \"4WG\", IF($A6-1 < SUM('Link-Group'!B$2:'Link-Group'!B$5), \"SIP\", IF($A6-1 < SUM('Link-Group'!B$2:'Link-Group'!B$6), \"IVC\", \"\")))))","v":"4W"},"High",null,{"$f":"IF($A6-1 < 'Link-Group'!C$2, \"2W\", IF($A6-1 < 'Link-Group'!C$2+'Link-Group'!C$3, \"4W\", IF($A6-1 < SUM('Link-Group'!C$2:'Link-Group'!C$4), \"4WG\", IF($A6-1 < SUM('Link-Group'!C$2:'Link-Group'!C$5), \"SIP\", IF($A6-1 < SUM('Link-Group'!C$2:'Link-Group'!C$6), \"IVC\", \"\")))))","v":""},"High",null,{"$f":"IF($A6-1 < 'Link-Group'!D$2, \"2W\", IF($A6-1 < 'Link-Group'!D$2+'Link-Group'!D$3, \"4W\", IF($A6-1 < SUM('Link-Group'!D$2:'Link-Group'!D$4), \"4WG\", IF($A6-1 < SUM('Link-Group'!D$2:'Link-Group'!D$5), \"SIP\", IF($A6-1 < SUM('Link-Group'!D$2:'Link-Group'!D$6), \"IVC\", \"\")))))","v":""},"High",null,{"$f":"IF($A6-1 < 'Link-Group'!E$2, \"2W\", IF($A6-1 < 'Link-Group'!E$2+'Link-Group'!E$3, \"4W\", IF($A6-1 < SUM('Link-Group'!E$2:'Link-Group'!E$4), \"4WG\", IF($A6-1 < SUM('Link-Group'!E$2:'Link-Group'!E$5), \"SIP\", IF($A6-1 < SUM('Link-Group'!E$2:'Link-Group'!E$6), \"IVC\", \"\")))))","v":""},"High",null,{"$f":"IF($A6-1 < 'Link-Group'!F$2, \"2W\", IF($A6-1 < 'Link-Group'!F$2+'Link-Group'!F$3, \"4W\", IF($A6-1 < SUM('Link-Group'!F$2:'Link-Group'!F$4), \"4WG\", IF($A6-1 < SUM('Link-Group'!F$2:'Link-Group'!F$5), \"SIP\", IF($A6-1 < SUM('Link-Group'!F$2:'Link-Group'!F$6), \"IVC\", \"\")))))","v":""},"High",null,{"$f":"IF($A6-1 < 'Link-Group'!G$2, \"2W\", IF($A6-1 < 'Link-Group'!G$2+'Link-Group'!G$3, \"4W\", IF($A6-1 < SUM('Link-Group'!G$2:'Link-Group'!G$4), \"4WG\", IF($A6-1 < SUM('Link-Group'!G$2:'Link-Group'!G$5), \"SIP\", IF($A6-1 < SUM('Link-Group'!G$2:'Link-Group'!G$6), \"IVC\", \"\")))))","v":""},"High"]
[4,{"$f":"IF($A7-1 < 'Link-Group'!B$2, \"2W\", IF($A7-1 < 'Link-Group'!B$2+'Link-Group'!B$3, \"4W\", IF($A7-1 < SUM('Link-Group'!B$2:'Link-Group'!B$4), \"4WG\", IF($A7-1 < SUM('Link-Group'!B$2:'Link-Group'!B$5), \"SIP\", IF($A7-1 < SUM('Link-Group'!B$2:'Link-Group'!B$6), \"IVC\", \"\")))))","v":"4W"},"High",null,{"$f":"IF($A7-1 < 'Link-Group'!C$2, \"2W\", IF($A7-1 < 'Link-Group'!C$2+'Link-Group'!C$3, \"4W\", IF($A7-1 < SUM('Link-Group'!C$2:'Link-Group'!C$4), \"4WG\", IF($A7-1 < SUM('Link-Group'!C$2:'Link-Group'!C$5), \"SIP\", IF($A7-1 < SUM('Link-Group'!C$2:'Link-Group'!C$6), \"IVC\", \"\")))))","v":""},"High",null,{"$f":"IF($A7-1 < 'Link-Group'!D$2, \"2W\", IF($A7-1 < 'Link-Group'!D$2+'Link-Group'!D$3, \"4W\", IF($A7-1 < SUM('Link-Group'!D$2:'Link-Group'!D$4), \"4WG\", IF($A7-1 < SUM('Link-Group'!D$2:'Link-Group'!D$5), \"SIP\", IF($A7-1 < SUM('Link-Group'!D$2:'Link-Group'!D$6), \"IVC\", \"\")))))","v":""},"High",null,{"$f":"IF($A7-1 < 'Link-Group'!E$2, \"2W\", IF($A7-1 < 'Link-Group'!E$2+'Link-Group'!E$3, \"4W\", IF($A7-1 < SUM('Link-Group'!E$2:'Link-Group'!E$4), \"4WG\", IF($A7-1 < SUM('Link-Group'!E$2:'Link-Group'!E$5), \"SIP\", IF($A7-1 < SUM('Link-Group'!E$2:'Link-Group'!E$6), \"IVC\", \"\")))))","v":""},"High",null,{"$f":"IF($A7-1 < 'Link-Group'!F$2, \"2W\", IF($A7-1 < 'Link-Group'!F$2+'Link-Group'!F$3, \"4W\", IF($A7-1 < SUM('Link-Group'!F$2:'Link-Group'!F$4), \"4WG\", IF($A7-1 < SUM('Link-Group'!F$2:'Link-Group'!F$5), \"SIP\", IF($A7-1 < SUM('Link-Group'!F$2:'Link-Group'!F$6), \"IVC\", \"\")))))","v":""},"High",null,{"$f":"IF($A7-1 < 'Link-Group'!G$2, \"2W\", IF($A7-1 < 'Link-Group'!G$2+'Link-Group'!G$3, \"4W\", IF($A7-1 < SUM('Link-Group'!G$2:'Link-Group'!G$4), \"4WG\", IF($A7-1 < SUM('Link-Group'!G$2:'Link-Group'!G$5), \"SIP\", IF($A7-1 < SUM('Link-Group'!G$2:'Link-Group'!G$6), \"IVC\", \"\")))))","v":""},"High"]
[5,{"$f":"IF($A8-1 < 'Link-Group'!B$2, \"2W\", IF($A8-1 < 'Link-Group'!B$2+'Link-Group'!B$3, \"4W\", IF($A8-1 < SUM('Link-Group'!B$2:'Link-Group'!B$4), \"4WG\", IF($A8-1 < SUM('Link-Group'!B$2:'Link-Group'!B$5), \"SIP\", IF($A8-1 < SUM('Link-Group'!B$2:'Link-Group'!B$6), \"IVC\", \"\")))))","v":"4W"},"High",null,{"$f":"IF($A8-1 < 'Link-Group'!C$2, \"2W\", IF($A8-1 < 'Link-Group'!C$2+'Link-Group'!C$3, \"4W\", IF($A8-1 < SUM('Link-Group'!C$2:'Link-Group'!C$4), \"4WG\", IF($A8-1 < SUM('Link-Group'!C$2:'Link-Group'!C$5), \"SIP\", IF($A8-1 < SUM('Link-Group'!C$2:'Link-Group'!C$6), \"IVC\", \"\")))))","v":""},"High",null,{"$f":"IF($A8-1 < 'Link-Group'!D$2, \"2W\", IF($A8-1 < 'Link-Group'!D$2+'Link-Group'!D$3, \"4W\", IF($A8-1 < SUM('Link-Group'!D$2:'Link-Group'!D$4), \"4WG\", IF($A8-1 < SUM('Link-Group'!D$2:'Link-Group'!D$5), \"SIP\", IF($A8-1 < SUM('Link-Group'!D$2:'Link-Group'!D$6), \"IVC\", \"\")))))","v":""},"High",null,{"$f":"IF($A8-1 < 'Link-Group'!E$2, \"2W\", IF($A8-1 < 'Link-Group'!E$2+'Link-Group'!E$3, \"4W\", IF($A8-1 < SUM('Link-Group'!E$2:'Link-Group'!E$4), \"4WG\", IF($A8-1 < SUM('Link-Group'!E$2:'Link-Group'!E$5), \"SIP\", IF($A8-1 < SUM('Link-Group'!E$2:'Link-Group'!E$6), \"IVC\", \"\")))))","v":""},"High",null,{"$f":"IF($A8-1 < 'Link-Group'!F$2, \"2W\", IF($A8-1 < 'Link-Group'!F$2+'Link-Group'!F$3, \"4W\", IF($A8-1 < SUM('Link-Group'!F$2:'Link-Group'!F$4), \"4WG\", IF($A8-1 < SUM('Link-Group'!F$2:'Link-Group'!F$5), \"SIP\", IF($A8-1 < SUM('Link-Group'!F$2:'Link-Group'!F$6), \"IVC\", \"\")))))","v":""},"High",null,{"$f":"IF($A8-1 < 'Link-Group'!G$2, \"2W\", IF($A8-1 < 'Link-Group'!G$2+'Link-Group'!G$3, \"4W\", IF($A8-1 < SUM('Link-Group'!G$2:'Link-Group'!G$4), \"4WG\", IF($A8-1 < SUM('Link-Group'!G$2:'Link-Group'!G$5), \"SIP\", IF($A8-1 < SUM('Link-Group'!G$2:'Link-Group'!G$6), \"IVC\", \"\")))))","v":""},"High"]
[6,{"$f":"IF($A9-1 < 'Link-Group'!B$2, \"2W\", IF($A9-1 < 'Link-Group'!B$2+'Link-Group'!B$3, \"4W\", IF($A9-1 < SUM('Link-Group'!B$2:'Link-Group'!B$4), \"4WG\", IF($A9-1 < SUM('Link-Group'!B$2:'Link-Group'!B$5), \"SIP\", IF($A9-1 < SUM('Link-Group'!B$2:'Link-Group'!B$6), \"IVC\", \"\")))))","v":"4W"},"High",null,{"$f":"IF($A9-1 < 'Link-Group'!C$2, \"2W\", IF($A9-1 < 'Link-Group'!C$2+'Link-Group'!C$3, \"4W\", IF($A9-1 < SUM('Link-Group'!C$2:'Link-Group'!C$4), \"4WG\", IF($A9-1 < SUM('Link-Group'!C$2:'Link-Group'!C$5), \"SIP\", IF($A9-1 < SUM('Link-Group'!C$2:'Link-Group'!C$6), \"IVC\", \"\")))))","v":""},"High",null,{"$f":"IF($A9-1 < 'Link-Group'!D$2, \"2W\", IF($A9-1 < 'Link-Group'!D$2+'Link-Group'!D$3, \"4W\", IF($A9-1 < SUM('Link-Group'!D$2:'Link-Group'!D$4), \"4WG\", IF($A9-1 < SUM('Link-Group'!D$2:'Link-Group'!D$5), \"SIP\", IF($A9-1 < SUM('Link-Group'!D$2:'Link-Group'!D$6), \"IVC\", \"\")))))","v":""},"High",null,{"$f":"IF($A9-1 < 'Link-Group'!E$2, \"2W\", IF($A9-1 < 'Link-Group'!E$2+'Link-Group'!E$3, \"4W\", IF($A9-1 < SUM('Link-Group'!E$2:'Link-Group'!E$4), \"4WG\", IF($A9-1 < SUM('Link-Group'!E$2:'Link-Group'!E$5), \"SIP\", IF($A9-1 < SUM('Link-Group'!E$2:'Link-Group'!E$6), \"IVC\", \"\")))))","v":""},"High",null,{"$f":"IF($A9-1 < 'Link-Group'!F$2, \"2W\", IF($A9-1 < 'Link-Group'!F$2+'Link-Group'!F$3, \"4W\", IF($A9-1 < SUM('Link-Group'!F$2:'Link-Group'!F$4), \"4WG\", IF($A9-1 < SUM('Link-Group'!F$2:'Link-Group'!F$5), \"SIP\", IF($A9-1 < SUM('Link-Group'!F$2:'Link-Group'!F$6), \"IVC\", \"\")))))","v":""},"High",null,{"$f":"IF($A9-1 < 'Link-Group'!G$2, \"2W\", IF($A9-1 < 'Link-Group'!G$2+'Link-Group'!G$3, \"4W\", IF($A9-1 < SUM('Link-Group'!G$2:'Link-Group'!G$4), \"4WG\", IF($A9-1 < SUM('Link-Group'!G$2:'Link-Group'!G$5), \"SIP\", IF($A9-1 < SUM('Link-Group'!G$2:'Link-Group'!G$6), \"IVC\", \"\")))))","v":""},"High"]
[7,{"$f":"IF($A10-1 < 'Link-Group'!B$2, \"2W\", IF($A10-1 < 'Link-Group'!B$2+'Link-Group'!B$3, \"4W\", IF($A10-1 < SUM('Link-Group'!B$2:'Link-Group'!B$4), \"4WG\", IF($A10-1 < SUM('Link-Group'!B$2:'Link-Group'!B$5), \"SIP\", IF($A10-1 < SUM('Link-Group'!B$2:'Link-Group'!B$6), \"IVC\", \"\")))))","v":"4W"},"High",null,{"$f":"IF($A10-1 < 'Link-Group'!C$2, \"2W\", IF($A10-1 < 'Link-Group'!C$2+'Link-Group'!C$3, \"4W\", IF($A10-1 < SUM('Link-Group'!C$2:'Link-Group'!C$4), \"4WG\", IF($A10-1 < SUM('Link-Group'!C$2:'Link-Group'!C$5), \"SIP\", IF($A10-1 < SUM('Link-Group'!C$2:'Link-Group'!C$6), \"IVC\", \"\")))))","v":""},"High",null,{"$f":"IF($A10-1 < 'Link-Group'!D$2, \"2W\", IF($A10-1 < 'Link-Group'!D$2+'Link-Group'!D$3, \"4W\", IF($A10-1 < SUM('Link-Group'!D$2:'Link-Group'!D$4), \"4WG\", IF($A10-1 < SUM('Link-Group'!D$2:'Link-Group'!D$5), \"SIP\", IF($A10-1 < SUM('Link-Group'!D$2:'Link-Group'!D$6), \"IVC\", \"\")))))","v":""},"High",null,{"$f":"IF($A10-1 < 'Link-Group'!E$2, \"2W\", IF($A10-1 < 'Link-Group'!E$2+'Link-Group'!E$3, \"4W\", IF($A10-1 < SUM('Link-Group'!E$2:'Link-Group'!E$4), \"4WG\", IF($A10-1 < SUM('Link-Group'!E$2:'Link-Group'!E$5), \"SIP\", IF($A10-1 < SUM('Link-Group'!E$2:'Link-Group'!E$6), \"IVC\", \"\")))))","v":""},"High",null,{"$f":"IF($A10-1 < 'Link-Group'!F$2, \"2W\", IF($A10-1 < 'Link-Group'!F$2+'Link-Group'!F$3, \"4W\", IF($A10-1 < SUM('Link-Group'!F$2:'Link-Group'!F$4), \"4WG\", IF($A10-1 < SUM('Link-Group'!F$2:'Link-Group'!F$5), \"SIP\", IF($A10-1 < SUM('Link-Group'!F$2:'Link-Group'!F$6), \"IVC\", \"\")))))","v":""},"High",null,{"$f":"IF($A10-1 < 'Link-Group'!G$2, \"2W\", IF($A10-1 < 'Link-Group'!G$2+'Link-Group'!G$3, \"4W\", IF($A10-1 < SUM('Link-Group'!G$2:'Link-Group'!G$4), \"4WG\", IF($A10-1 < SUM('Link-Group'!G$2:'Link-Group'!G$5), \"SIP\", IF($A10-1 < SUM('Link-Group'!G$2:'Link-Group'!G$6), \"IVC\", \"\")))))","v":""},"High"]
[8,{"$f":"IF($A11-1 < 'Link-Group'!B$2, \"2W\", IF($A11-1 < 'Link-Group'!B$2+'Link-Group'!B$3, \"4W\", IF($A11-1 < SUM('Link-Group'!B$2:'Link-Group'!B$4), \"4WG\", IF($A11-1 < SUM('Link-Group'!B$2:'Link-Group'!B$5), \"SIP\", IF($A11-1 < SUM('Link-Group'!B$2:'Link-Group'!B$6), \"IVC\", \"\")))))","v":"4W"},"High",null,{"$f":"IF($A11-1 < 'Link-Group'!C$2, \"2W\", IF($A11-1 < 'Link-Group'!C$2+'Link-Group'!C$3, \"4W\", IF($A11-1 < SUM('Link-Group'!C$2:'Link-Group'!C$4), \"4WG\", IF($A11-1 < SUM('Link-Group'!C$2:'Link-Group'!C$5), \"SIP\", IF($A11-1 < SUM('Link-Group'!C$2:'Link-Group'!C$6), \"IVC\", \"\")))))","v":""},"High",null,{"$f":"IF($A11-1 < 'Link-Group'!D$2, \"2W\", IF($A11-1 < 'Link-Group'!D$2+'Link-Group'!D$3, \"4W\", IF($A11-1 < SUM('Link-Group'!D$2:'Link-Group'!D$4), \"4WG\", IF($A11-1 < SUM('Link-Group'!D$2:'Link-Group'!D$5), \"SIP\", IF($A11-1 < SUM('Link-Group'!D$2:'Link-Group'!D$6), \"IVC\", \"\")))))","v":""},"High",null,{"$f":"IF($A11-1 < 'Link-Group'!E$2, \"2W\", IF($A11-1 < 'Link-Group'!E$2+'Link-Group'!E$3, \"4W\", IF($A11-1 < SUM('Link-Group'!E$2:'Link-Group'!E$4), \"4WG\", IF($A11-1 < SUM('Link-Group'!E$2:'Link-Group'!E$5), \"SIP\", IF($A11-1 < SUM('Link-Group'!E$2:'Link-Group'!E$6), \"IVC\", \"\")))))","v":""},"High",null,{"$f":"IF($A11-1 < 'Link-Group'!F$2, \"2W\", IF($A11-1 < 'Link-Group'!F$2+'Link-Group'!F$3, \"4W\", IF($A11-1 < SUM('Link-Group'!F$2:'Link-Group'!F$4), \"4WG\", IF($A11-1 < SUM('Link-Group'!F$2:'Link-Group'!F$5), \"SIP\", IF($A11-1 < SUM('Link-Group'!F$2:'Link-Group'!F$6), \"IVC\", \"\")))))","v":""},"High",null,{"$f":"IF($A11-1 < 'Link-Group'!G$2, \"2W\", IF($A11-1 < 'Link-Group'!G$2+'Link-Group'!G$3, \"4W\", IF($A11-1 < SUM('Link-Group'!G$2:'Link-Group'!G$4), \"4WG\", IF($A11-1 < SUM('Link-Group'!G$2:'Link-Group'!G$5), \"SIP\", IF($A11-1 < SUM('Link-Group'!G$2:'Link-Group'!G$6), \"IVC\", \"\")))))","v":""},"High"]
[9,{"$f":"IF($A12-1 < 'Link-Group'!B$2, \"2W\", IF($A12-1 < 'Link-Group'!B$2+'Link-Group'!B$3, \"4W\", IF($A12-1 < SUM('Link-Group'!B$2:'Link-Group'!B$4), \"4WG\", IF($A12-1 < SUM('Link-Group'!B$2:'Link-Group'!B$5), \"SIP\", IF($A12-1 < SUM('Link-Group'!B$2:'Link-Group'!B$6), \"IVC\", \"\")))))","v":"SIP"},"High",null,{"$f":"IF($A12-1 < 'Link-Group'!C$2, \"2W\", IF($A12-1 < 'Link-Group'!C$2+'Link-Group'!C$3, \"4W\", IF($A12-1 < SUM('Link-Group'!C$2:'Link-Group'!C$4), \"4WG\", IF($A12-1 < SUM('Link-Group'!C$2:'Link-Group'!C$5), \"SIP\", IF($A12-1 < SUM('Link-Group'!C$2:'Link-Group'!C$6), \"IVC\", \"\")))))","v":""},"High",null,{"$f":"IF($A12-1 < 'Link-Group'!D$2, \"2W\", IF($A12-1 < 'Link-Group'!D$2+'Link-Group'!D$3, \"4W\", IF($A12-1 < SUM('Link-Group'!D$2:'Link-Group'!D$4), \"4WG\", IF($A12-1 < SUM('Link-Group'!D$2:'Link-Group'!D$5), \"SIP\", IF($A12-1 < SUM('Link-Group'!D$2:'Link-Group'!D$6), \"IVC\", \"\")))))","v":""},"High",null,{"$f":"IF($A12-1 < 'Link-Group'!E$2, \"2W\", IF($A12-1 < 'Link-Group'!E$2+'Link-Group'!E$3, \"4W\", IF($A12-1 < SUM('Link-Group'!E$2:'Link-Group'!E$4), \"4WG\", IF($A12-1 < SUM('Link-Group'!E$2:'Link-Group'!E$5), \"SIP\", IF($A12-1 < SUM('Link-Group'!E$2:'Link-Group'!E$6), \"IVC\", \"\")))))","v":""},"High",null,{"$f":"IF($A12-1 < 'Link-Group'!F$2, \"2W\", IF($A12-1 < 'Link-Group'!F$2+'Link-Group'!F$3, \"4W\", IF($A12-1 < SUM('Link-Group'!F$2:'Link-Group'!F$4), \"4WG\", IF($A12-1 < SUM('Link-Group'!F$2:'Link-Group'!F$5), \"SIP\", IF($A12-1 < SUM('Link-Group'!F$2:'Link-Group'!F$6), \"IVC\", \"\")))))","v":""},"High",1,{"$f":"IF($A12-1 < 'Link-Group'!G$2, \"2W\", IF($A12-1 < 'Link-Group'!G$2+'Link-Group'!G$3, \"4W\", IF($A12-1 < SUM('Link-Group'!G$2:'Link-Group'!G$4), \"4WG\", IF($A12-1 < SUM('Link-Group'!G$2:'Link-Group'!G$5), \"SIP\", IF($A12-1 < SUM('Link-Group'!G$2:'Link-Group'!G$6), \"IVC\", \"\")))))","v":""},"High"]
[10,{"$f":"IF($A13-1 < 'Link-Group'!B$2, \"2W\", IF($A13-1 < 'Link-Group'!B$2+'Link-Group'!B$3, \"4W\", IF($A13-1 < SUM('Link-Group'!B$2:'Link-Group'!B$4), \"4WG\", IF($A13-1 < SUM('Link-Group'!B$2:'Link-Group'!B$5), \"SIP\", IF($A13-1 < SUM('Link-Group'!B$2:'Link-Group'!B$6), \"IVC\", \"\")))))","v":"SIP"},"High",null,{"$f":"IF($A13-1 < 'Link-Group'!C$2, \"2W\", IF($A13-1 < 'Link-Group'!C$2+'Link-Group'!C$3, \"4W\", IF($A13-1 < SUM('Link-Group'!C$2:'Link-Group'!C$4), \"4WG\", IF($A13-1 < SUM('Link-Group'!C$2:'Link-Group'!C$5), \"SIP\", IF($A13-1 < SUM('Link-Group'!C$2:'Link-Group'!C$6), \"IVC\", \"\")))))","v":""},"High",null,{"$f":"IF($A13-1 < 'Link-Group'!D$2, \"2W\", IF($A13-1 < 'Link-Group'!D$2+'Link-Group'!D$3, \"4W\", IF($A13-1 < SUM('Link-Group'!D$2:'Link-Group'!D$4), \"4WG\", IF($A13-1 < SUM('Link-Group'!D$2:'Link-Group'!D$5), \"SIP\", IF($A13-1 < SUM('Link-Group'!D$2:'Link-Group'!D$6), \"IVC\", \"\")))))","v":""},"High",null,{"$f":"IF($A13-1 < 'Link-Group'!E$2, \"2W\", IF($A13-1 < 'Link-Group'!E$2+'Link-Group'!E$3, \"4W\", IF($A13-1 < SUM('Link-Group'!E$2:'Link-Group'!E$4), \"4WG\", IF($A13-1 < SUM('Link-Group'!E$2:'Link-Group'!E$5), \"SIP\", IF($A13-1 < SUM('Link-Group'!E$2:'Link-Group'!E$6), \"IVC\", \"\")))))","v":""},"High",null,{"$f":"IF($A13-1 < 'Link-Group'!F$2, \"2W\", IF($A13-1 < 'Link-Group'!F$2+'Link-Group'!F$3, \"4W\", IF($A13-1 < SUM('Link-Group'!F$2:'Link-Group'!F$4), \"4WG\", IF($A13-1 < SUM('Link-Group'!F$2:'Link-Group'!F$5), \"SIP\", IF($A13-1 < SUM('Link-Group'!F$2:'Link-Group'!F$6), \"IVC\", \"\")))))","v":""},"High",null,{"$f":"IF($A13-1 < 'Link-Group'!G$2, \"2W\", IF($A13-1 < 'Link-Group'!G$2+'Link-Group'!G$3, \"4W\", IF($A13-1 < SUM('Link-Group'!G$2:'Link-Group'!G$4), \"4WG\", IF($A13-1 < SUM('Link-Group'!G$2:'Link-Group'!G$5), \"SIP\", IF($A13-1 < SUM('Link-Group'!G$2:'Link-Group'!G$6), \"IVC\", \"\")))))","v":""},"High"]
[11,{"$f":"IF($A14-1 < 'Link-Group'!B$2, \"2W\", IF($A14-1 < 'Link-Group'!B$2+'Link-Group'!B$3, \"4W\", IF($A14-1 < SUM('Link-Group'!B$2:'Link-Group'!B$4), \"4WG\", IF($A14-1 < SUM('Link-Group'!B$2:'Link-Group'!B$5), \"SIP\", IF($A14-1 < SUM('Link-Group'!B$2:'Link-Group'!B$6), \"IVC\", \"\")))))","v":"SIP"},"High",null,{"$f":"IF($A14-1 < 'Link-Group'!C$2, \"2W\", IF($A14-1 < 'Link-Group'!C$2+'Link-Group'!C$3, \"4W\", IF($A14-1 < SUM('Link-Group'!C$2:'Link-Group'!C$4), \"4WG\", IF($A14-1 < SUM('Link-Group'!C$2:'Link-Group'!C$5), \"SIP\", IF($A14-1 < SUM('Link-Group'!C$2:'Link-Group'!C$6), \"IVC\", \"\")))))","v":""},"High",null,{"$f":"IF($A14-1 < 'Link-Group'!D$2, \"2W\", IF($A14-1 < 'Link-Group'!D$2+'Link-Group'!D$3, \"4W\", IF($A14-1 < SUM('Link-Group'!D$2:'Link-Group'!D$4), \"4WG\", IF($A14-1 < SUM('Link-Group'!D$2:'Link-Group'!D$5), \"SIP\", IF($A14-1 < SUM('Link-Group'!D$2:'Link-Group'!D$6), \"IVC\", \"\")))))","v":""},"High",null,{"$f":"IF($A14-1 < 'Link-Group'!E$2, \"2W\", IF($A14-1 < 'Link-Group'!E$2+'Link-Group'!E$3, \"4W\", IF($A14-1 < SUM('Link-Group'!E$2:'Link-Group'!E$4), \"4WG\", IF($A14-1 < SUM('Link-Group'!E$2:'Link-Group'!E$5), \"SIP\", IF($A14-1 < SUM('Link-Group'!E$2:'Link-Group'!E$6), \"IVC\", \"\")))))","v":""},"High",null,{"$f":"IF($A14-1 < 'Link-Group'!F$2, \"2W\", IF($A14-1 < 'Link-Group'!F$2+'Link-Group'!F$3, \"4W\", IF($A14-1 < SUM('Link-Group'!F$2:'Link-Group'!F$4), \"4WG\", IF($A14-1 < SUM('Link-Group'!F$2:'Link-Group'!F$5), \"SIP\", IF($A14-1 < SUM('Link-Group'!F$2:'Link-Group'!F$6), \"IVC\", \"\")))))","v":""},"High",null,{"$f":"IF($A14-1 < 'Link-Group'!G$2, \"2W\", IF($A14-1 < 'Link-Group'!G$2+'Link-Group'!G$3, \"4W\", IF($A14-1 < SUM('Link-Group'!G$2:'Link-Group'!G$4), \"4WG\", IF($A14-1 < SUM('Link-Group'!G$2:'Link-Group'!G$5), \"SIP\", IF($A14-1 < SUM('Link-Group'!G$2:'Link-Group'!G$6), \"IVC\", \"\")))))","v":""},"High"]
[12,{"$f":"IF($A15-1 < 'Link-Group'!B$2, \"2W\", IF($A15-1 < 'Link-Group'!B$2+'Link-Group'!B$3, \"4W\", IF($A15-1 < SUM('Link-Group'!B$2:'Link-Group'!B$4), \"4WG\", IF($A15-1 < SUM('Link-Group'!B$2:'Link-Group'!B$5), \"SIP\", IF($A15-1 < SUM('Link-Group'!B$2:'Link-Group'!B$6), \"IVC\", \"\")))))","v":"SIP"},"High",null,{"$f":"IF($A15-1 < 'Link-Group'!C$2, \"2W\", IF($A15-1 < 'Link-Group'!C$2+'Link-Group'!C$3, \"4W\", IF($A15-1 < SUM('Link-Group'!C$2:'Link-Group'!C$4), \"4WG\", IF($A15-1 < SUM('Link-Group'!C$2:'Link-Group'!C$5), \"SIP\", IF($A15-1 < SUM('Link-Group'!C$2:'Link-Group'!C$6), \"IVC\", \"\")))))","v":""},"High",null,{"$f":"IF($A15-1 < 'Link-Group'!D$2, \"2W\", IF($A15-1 < 'Link-Group'!D$2+'Link-Group'!D$3, \"4W\", IF($A15-1 < SUM('Link-Group'!D$2:'Link-Group'!D$4), \"4WG\", IF($A15-1 < SUM('Link-Group'!D$2:'Link-Group'!D$5), \"SIP\", IF($A15-1 < SUM('Link-Group'!D$2:'Link-Group'!D$6), \"IVC\", \"\")))))","v":""},"High",null,{"$f":"IF($A15-1 < 'Link-Group'!E$2, \"2W\", IF($A15-1 < 'Link-Group'!E$2+'Link-Group'!E$3, \"4W\", IF($A15-1 < SUM('Link-Group'!E$2:'Link-Group'!E$4), \"4WG\", IF($A15-1 < SUM('Link-Group'!E$2:'Link-Group'!E$5), \"SIP\", IF($A15-1 < SUM('Link-Group'!E$2:'Link-Group'!E$6), \"IVC\", \"\")))))","v":""},"High",null,{"$f":"IF($A15-1 < 'Link-Group'!F$2, \"2W\", IF($A15-1 < 'Link-Group'!F$2+'Link-Group'!F$3, \"4W\", IF($A15-1 < SUM('Link-Group'!F$2:'Link-Group'!F$4), \"4WG\", IF($A15-1 < SUM('Link-Group'!F$2:'Link-Group'!F$5), \"SIP\", IF($A15-1 < SUM('Link-Group'!F$2:'Link-Group'!F$6), \"IVC\", \"\")))))","v":""},"High",null,{"$f":"IF($A15-1 < 'Link-Group'!G$2, \"2W\", IF($A15-1 < 'Link-Group'!G$2+'Link-Group'!G$3, \"4W\", IF($A15-1 < SUM('Link-Group'!G$2:'Link-Group'!G$4), \"4WG\", IF($A15-1 < SUM('Link-Group'!G$2:'Link-Group'!G$5), \"SIP\", IF($A15-1 < SUM('Link-Group'!G$2:'Link-Group'!G$6), \"IVC\", \"\")))))","v":""},"High"]
[13,{"$f":"IF($A16-1 < 'Link-Group'!B$2, \"2W\", IF($A16-1 < 'Link-Group'!B$2+'Link-Group'!B$3, \"4W\", IF($A16-1 < SUM('Link-Group'!B$2:'Link-Group'!B$4), \"4WG\", IF($A16-1 < SUM('Link-Group'!B$2:'Link-Group'!B$5), \"SIP\", IF($A16-1 < SUM('Link-Group'!B$2:'Link-Group'!B$6), \"IVC\", \"\")))))","v":"SIP"},"High",null,{"$f":"IF($A16-1 < 'Link-Group'!C$2, \"2W\", IF($A16-1 < 'Link-Group'!C$2+'Link-Group'!C$3, \"4W\", IF($A16-1 < SUM('Link-Group'!C$2:'Link-Group'!C$4), \"4WG\", IF($A16-1 < SUM('Link-Group'!C$2:'Link-Group'!C$5), \"SIP\", IF($A16-1 < SUM('Link-Group'!C$2:'Link-Group'!C$6), \"IVC\", \"\")))))","v":""},"High",null,{"$f":"IF($A16-1 < 'Link-Group'!D$2, \"2W\", IF($A16-1 < 'Link-Group'!D$2+'Link-Group'!D$3, \"4W\", IF($A16-1 < SUM('Link-Group'!D$2:'Link-Group'!D$4), \"4WG\", IF($A16-1 < SUM('Link-Group'!D$2:'Link-Group'!D$5), \"SIP\", IF($A16-1 < SUM('Link-Group'!D$2:'Link-Group'!D$6), \"IVC\", \"\")))))","v":""},"High",null,{"$f":"IF($A16-1 < 'Link-Group'!E$2, \"2W\", IF($A16-1 < 'Link-Group'!E$2+'Link-Group'!E$3, \"4W\", IF($A16-1 < SUM('Link-Group'!E$2:'Link-Group'!E$4), \"4WG\", IF($A16-1 < SUM('Link-Group'!E$2:'Link-Group'!E$5), \"SIP\", IF($A16-1 < SUM('Link-Group'!E$2:'Link-Group'!E$6), \"IVC\", \"\")))))","v":""},"High",null,{"$f":"IF($A16-1 < 'Link-Group'!F$2, \"2W\", IF($A16-1 < 'Link-Group'!F$2+'Link-Group'!F$3, \"4W\", IF($A16-1 < SUM('Link-Group'!F$2:'Link-Group'!F$4), \"4WG\", IF($A16-1 < SUM('Link-Group'!F$2:'Link-Group'!F$5), \"SIP\", IF($A16-1 < SUM('Link-Group'!F$2:'Link-Group'!F$6), \"IVC\", \"\")))))","v":""},"High",null,{"$f":"IF($A16-1 < 'Link-Group'!G$2, \"2W\", IF($A16-1 < 'Link-Group'!G$2+'Link-Group'!G$3, \"4W\", IF($A16-1 < SUM('Link-Group'!G$2:'Link-Group'!G$4), \"4WG\", IF($A16-1 < SUM('Link-Group'!G$2:'Link-Group'!G$5), \"SIP\", IF($A16-1 < SUM('Link-Group'!G$2:'Link-Group'!G$6), \"IVC\", \"\")))))","v":""},"High"]
[14,{"$f":"IF($A17-1 < 'Link-Group'!B$2, \"2W\", IF($A17-1 < 'Link-Group'!B$2+'Link-Group'!B$3, \"4W\", IF($A17-1 < SUM('Link-Group'!B$2:'Link-Group'!B$4), \"4WG\", IF($A17-1 < SUM('Link-Group'!B$2:'Link-Group'!B$5), \"SIP\", IF($A17-1 < SUM('Link-Group'!B$2:'Link-Group'!B$6), \"IVC\", \"\")))))","v":"SIP"},"High",null,{"$f":"IF($A17-1 < 'Link-Group'!C$2, \"2W\", IF($A17-1 < 'Link-Group'!C$2+'Link-Group'!C$3, \"4W\", IF($A17-1 < SUM('Link-Group'!C$2:'Link-Group'!C$4), \"4WG\", IF($A17-1 < SUM('Link-Group'!C$2:'Link-Group'!C$5), \"SIP\", IF($A17-1 < SUM('Link-Group'!C$2:'Link-Group'!C$6), \"IVC\", \"\")))))","v":""},"High",null,{"$f":"IF($A17-1 < 'Link-Group'!D$2, \"2W\", IF($A17-1 < 'Link-Group'!D$2+'Link-Group'!D$3, \"4W\", IF($A17-1 < SUM('Link-Group'!D$2:'Link-Group'!D$4), \"4WG\", IF($A17-1 < SUM('Link-Group'!D$2:'Link-Group'!D$5), \"SIP\", IF($A17-1 < SUM('Link-Group'!D$2:'Link-Group'!D$6), \"IVC\", \"\")))))","v":""},"High",null,{"$f":"IF($A17-1 < 'Link-Group'!E$2, \"2W\", IF($A17-1 < 'Link-Group'!E$2+'Link-Group'!E$3, \"4W\", IF($A17-1 < SUM('Link-Group'!E$2:'Link-Group'!E$4), \"4WG\", IF($A17-1 < SUM('Link-Group'!E$2:'Link-Group'!E$5), \"SIP\", IF($A17-1 < SUM('Link-Group'!E$2:'Link-Group'!E$6), \"IVC\", \"\")))))","v":""},"High",null,{"$f":"IF($A17-1 < 'Link-Group'!F$2, \"2W\", IF($A17-1 < 'Link-Group'!F$2+'Link-Group'!F$3, \"4W\", IF($A17-1 < SUM('Link-Group'!F$2:'Link-Group'!F$4), \"4WG\", IF($A17-1 < SUM('Link-Group'!F$2:'Link-Group'!F$5), \"SIP\", IF($A17-1 < SUM('Link-Group'!F$2:'Link-Group'!F$6), \"IVC\", \"\")))))","v":""},"High",null,{"$f":"IF($A17-1 < 'Link-Group'!G$2, \"2W\", IF($A17-1 < 'Link-Group'!G$2+'Link-Group'!G$3, \"4W\", IF($A17-1 < SUM('Link-Group'!G$2:'Link-Group'!G$4), \"4WG\", IF($A17-1 < SUM('Link-Group'!G$2:'Link-Group'!G$5), \"SIP\", IF($A17-1 < SUM('Link-Group'!G$2:'Link-Group'!G$6), \"IVC\", \"\")))))","v":""},"High"]
[15,{"$f":"IF($A18-1 < 'Link-Group'!B$2, \"2W\", IF($A18-1 < 'Link-Group'!B$2+'Link-Group'!B$3, \"4W\", IF($A18-1 < SUM('Link-Group'!B$2:'Link-Group'!B$4), \"4WG\", IF($A18-1 < SUM('Link-Group'!B$2:'Link-Group'!B$5), \"SIP\", IF($A18-1 < SUM('Link-Group'!B$2:'Link-Group'!B$6), \"IVC\", \"\")))))","v":"SIP"},"High",null,{"$f":"IF($A18-1 < 'Link-Group'!C$2, \"2W\", IF($A18-1 < 'Link-Group'!C$2+'Link-Group'!C$3, \"4W\", IF($A18-1 < SUM('Link-Group'!C$2:'Link-Group'!C$4), \"4WG\", IF($A18-1 < SUM('Link-Group'!C$2:'Link-Group'!C$5), \"SIP\", IF($A18-1 < SUM('Link-Group'!C$2:'Link-Group'!C$6), \"IVC\", \"\")))))","v":""},"High",null,{"$f":"IF($A18-1 < 'Link-Group'!D$2, \"2W\", IF($A18-1 < 'Link-Group'!D$2+'Link-Group'!D$3, \"4W\", IF($A18-1 < SUM('Link-Group'!D$2:'Link-Group'!D$4), \"4WG\", IF($A18-1 < SUM('Link-Group'!D$2:'Link-Group'!D$5), \"SIP\", IF($A18-1 < SUM('Link-Group'!D$2:'Link-Group'!D$6), \"IVC\", \"\")))))","v":""},"High",null,{"$f":"IF($A18-1 < 'Link-Group'!E$2, \"2W\", IF($A18-1 < 'Link-Group'!E$2+'Link-Group'!E$3, \"4W\", IF($A18-1 < SUM('Link-Group'!E$2:'Link-Group'!E$4), \"4WG\", IF($A18-1 < SUM('Link-Group'!E$2:'Link-Group'!E$5), \"SIP\", IF($A18-1 < SUM('Link-Group'!E$2:'Link-Group'!E$6), \"IVC\", \"\")))))","v":""},"High",null,{"$f":"IF($A18-1 < 'Link-Group'!F$2, \"2W\", IF($A18-1 < 'Link-Group'!F$2+'Link-Group'!F$3, \"4W\", IF($A18-1 < SUM('Link-Group'!F$2:'Link-Group'!F$4), \"4WG\", IF($A18-1 < SUM('Link-Group'!F$2:'Link-Group'!F$5), \"SIP\", IF($A18-1 < SUM('Link-Group'!F$2:'Link-Group'!F$6), \"IVC\", \"\")))))","v":""},"High",null,{"$f":"IF($A18-1 < 'Link-Group'!G$2, \"2W\", IF($A18-1 < 'Link-Group'!G$2+'Link-Group'!G$3, \"4W\", IF($A18-1 < SUM('Link-Group'!G$2:'Link-Group'!G$4), \"4WG\", IF($A18-1 < SUM('Link-Group'!G$2:'Link-Group'!G$5), \"SIP\", IF($A18-1 < SUM('Link-Group'!G$2:'Link-Group'!G$6), \"IVC\", \"\")))))","v":""},"High"]
[16,{"$f":"IF($A19-1 < 'Link-Group'!B$2, \"2W\", IF($A19-1 < 'Link-Group'!B$2+'Link-Group'!B$3, \"4W\", IF($A19-1 < SUM('Link-Group'!B$2:'Link-Group'!B$4), \"4WG\", IF($A19-1 < SUM('Link-Group'!B$2:'Link-Group'!B$5), \"SIP\", IF($A19-1 < SUM('Link-Group'!B$2:'Link-Group'!B$6), \"IVC\", \"\")))))","v":"SIP"},"High",null,{"$f":"IF($A19-1 < 'Link-Group'!C$2, \"2W\", IF($A19-1 < 'Link-Group'!C$2+'Link-Group'!C$3, \"4W\", IF($A19-1 < SUM('Link-Group'!C$2:'Link-Group'!C$4), \"4WG\", IF($A19-1 < SUM('Link-Group'!C$2:'Link-Group'!C$5), \"SIP\", IF($A19-1 < SUM('Link-Group'!C$2:'Link-Group'!C$6), \"IVC\", \"\")))))","v":""},"High",null,{"$f":"IF($A19-1 < 'Link-Group'!D$2, \"2W\", IF($A19-1 < 'Link-Group'!D$2+'Link-Group'!D$3, \"4W\", IF($A19-1 < SUM('Link-Group'!D$2:'Link-Group'!D$4), \"4WG\", IF($A19-1 < SUM('Link-Group'!D$2:'Link-Group'!D$5), \"SIP\", IF($A19-1 < SUM('Link-Group'!D$2:'Link-Group'!D$6), \"IVC\", \"\")))))","v":""},"High",null,{"$f":"IF($A19-1 < 'Link-Group'!E$2, \"2W\", IF($A19-1 < 'Link-Group'!E$2+'Link-Group'!E$3, \"4W\", IF($A19-1 < SUM('Link-Group'!E$2:'Link-Group'!E$4), \"4WG\", IF($A19-1 < SUM('Link-Group'!E$2:'Link-Group'!E$5), \"SIP\", IF($A19-1 < SUM('Link-Group'!E$2:'Link-Group'!E$6), \"IVC\", \"\")))))","v":""},"High",null,{"$f":"IF($A19-1 < 'Link-Group'!F$2, \"2W\", IF($A19-1 < 'Link-Group'!F$2+'Link-Group'!F$3, \"4W\", IF($A19-1 < SUM('Link-Group'!F$2:'Link-Group'!F$4), \"4WG\", IF($A19-1 < SUM('Link-Group'!F$2:'Link-Group'!F$5), \"SIP\", IF($A19-1 < SUM('Link-Group'!F$2:'Link-Group'!F$6), \"IVC\", \"\")))))","v":""},"High",null,{"$f":"IF($A19-1 < 'Link-Group'!G$2, \"2W\", IF($A19-1 < 'Link-Group'!G$2+'Link-Group'!G$3, \"4W\", IF($A19-1 < SUM('Link-Group'!G$2:'Link-Group'!G$4), \"4WG\", IF($A19-1 < SUM('Link-Group'!G$2:'Link-Group'!G$5), \"SIP\", IF($A19-1 < SUM('Link-Group'!G$2:'Link-Group'!G$6), \"IVC\", \"\")))))","v":""},"High"]
[17,{"$f":"IF($A20-1 < 'Link-Group'!B$2, \"2W\", IF($A20-1 < 'Link-Group'!B$2+'Link-Group'!B$3, \"4W\", IF($A20-1 < SUM('Link-Group'!B$2:'Link-Group'!B$4), \"4WG\", IF($A20-1 < SUM('Link-Group'!B$2:'Link-Group'!B$5), \"SIP\", IF($A20-1 < SUM('Link-Group'!B$2:'Link-Group'!B$6), \"IVC\", \"\")))))","v":"IVC"},"High",null,{"$f":"IF($A20-1 < 'Link-Group'!C$2, \"2W\", IF($A20-1 < 'Link-Group'!C$2+'Link-Group'!C$3, \"4W\", IF($A20-1 < SUM('Link-Group'!C$2:'Link-Group'!C$4), \"4WG\", IF($A20-1 < SUM('Link-Group'!C$2:'Link-Group'!C$5), \"SIP\", IF($A20-1 < SUM('Link-Group'!C$2:'Link-Group'!C$6), \"IVC\", \"\")))))","v":""},"High",null,{"$f":"IF($A20-1 < 'Link-Group'!D$2, \"2W\", IF($A20-1 < 'Link-Group'!D$2+'Link-Group'!D$3, \"4W\", IF($A20-1 < SUM('Link-Group'!D$2:'Link-Group'!D$4), \"4WG\", IF($A20-1 < SUM('Link-Group'!D$2:'Link-Group'!D$5), \"SIP\", IF($A20-1 < SUM('Link-Group'!D$2:'Link-Group'!D$6), \"IVC\", \"\")))))","v":""},"High",null,{"$f":"IF($A20-1 < 'Link-Group'!E$2, \"2W\", IF($A20-1 < 'Link-Group'!E$2+'Link-Group'!E$3, \"4W\", IF($A20-1 < SUM('Link-Group'!E$2:'Link-Group'!E$4), \"4WG\", IF($A20-1 < SUM('Link-Group'!E$2:'Link-Group'!E$5), \"SIP\", IF($A20-1 < SUM('Link-Group'!E$2:'Link-Group'!E$6), \"IVC\", \"\")))))","v":""},"High",null,{"$f":"IF($A20-1 < 'Link-Group'!F$2, \"2W\", IF($A20-1 < 'Link-Group'!F$2+'Link-Group'!F$3, \"4W\", IF($A20-1 < SUM('Link-Group'!F$2:'Link-Group'!F$4), \"4WG\", IF($A20-1 < SUM('Link-Group'!F$2:'Link-Group'!F$5), \"SIP\", IF($A20-1 < SUM('Link-Group'!F$2:'Link-Group'!F$6), \"IVC\", \"\")))))","v":""},"High",null,{"$f":"IF($A20-1 < 'Link-Group'!G$2, \"2W\", IF($A20-1 < 'Link-Group'!G$2+'Link-Group'!G$3, \"4W\", IF($A20-1 < SUM('Link-Group'!G$2:'Link-Group'!G$4), \"4WG\", IF($A20-1 < SUM('Link-Group'!G$2:'Link-Group'!G$5), \"SIP\", IF($A20-1 < SUM('Link-Group'!G$2:'Link-Group'!G$6), \"IVC\", \"\")))))","v":""},"High"]
[18,{"$f":"IF($A21-1 < 'Link-Group'!B$2, \"2W\", IF($A21-1 < 'Link-Group'!B$2+'Link-Group'!B$3, \"4W\", IF($A21-1 < SUM('Link-Group'!B$2:'Link-Group'!B$4), \"4WG\", IF($A21-1 < SUM('Link-Group'!B$2:'Link-Group'!B$5), \"SIP\", IF($A21-1 < SUM('Link-Group'!B$2:'Link-Group'!B$6), \"IVC\", \"\")))))","v":"IVC"},"High",null,{"$f":"IF($A21-1 < 'Link-Group'!C$2, \"2W\", IF($A21-1 < 'Link-Group'!C$2+'Link-Group'!C$3, \"4W\", IF($A21-1 < SUM('Link-Group'!C$2:'Link-Group'!C$4), \"4WG\", IF($A21-1 < SUM('Link-Group'!C$2:'Link-Group'!C$5), \"SIP\", IF($A21-1 < SUM('Link-Group'!C$2:'Link-Group'!C$6), \"IVC\", \"\")))))","v":""},"High",null,{"$f":"IF($A21-1 < 'Link-Group'!D$2, \"2W\", IF($A21-1 < 'Link-Group'!D$2+'Link-Group'!D$3, \"4W\", IF($A21-1 < SUM('Link-Group'!D$2:'Link-Group'!D$4), \"4WG\", IF($A21-1 < SUM('Link-Group'!D$2:'Link-Group'!D$5), \"SIP\", IF($A21-1 < SUM('Link-Group'!D$2:'Link-Group'!D$6), \"IVC\", \"\")))))","v":""},"High",null,{"$f":"IF($A21-1 < 'Link-Group'!E$2, \"2W\", IF($A21-1 < 'Link-Group'!E$2+'Link-Group'!E$3, \"4W\", IF($A21-1 < SUM('Link-Group'!E$2:'Link-Group'!E$4), \"4WG\", IF($A21-1 < SUM('Link-Group'!E$2:'Link-Group'!E$5), \"SIP\", IF($A21-1 < SUM('Link-Group'!E$2:'Link-Group'!E$6), \"IVC\", \"\")))))","v":""},"High",null,{"$f":"IF($A21-1 < 'Link-Group'!F$2, \"2W\", IF($A21-1 < 'Link-Group'!F$2+'Link-Group'!F$3, \"4W\", IF($A21-1 < SUM('Link-Group'!F$2:'Link-Group'!F$4), \"4WG\", IF($A21-1 < SUM('Link-Group'!F$2:'Link-Group'!F$5), \"SIP\", IF($A21-1 < SUM('Link-Group'!F$2:'Link-Group'!F$6), \"IVC\", \"\")))))","v":""},"High",null,{"$f":"IF($A21-1 < 'Link-Group'!G$2, \"2W\", IF($A21-1 < 'Link-Group'!G$2+'Link-Group'!G$3, \"4W\", IF($A21-1 < SUM('Link-Group'!G$2:'Link-Group'!G$4), \"4WG\", IF($A21-1 < SUM('Link-Group'!G$2:'Link-Group'!G$5), \"SIP\", IF($A21-1 < SUM('Link-Group'!G$2:'Link-Group'!G$6), \"IVC\", \"\")))))","v":""},"High"]
[19,{"$f":"IF($A22-1 < 'Link-Group'!B$2, \"2W\", IF($A22-1 < 'Link-Group'!B$2+'Link-Group'!B$3, \"4W\", IF($A22-1 < SUM('Link-Group'!B$2:'Link-Group'!B$4), \"4WG\", IF($A22-1 < SUM('Link-Group'!B$2:'Link-Group'!B$5), \"SIP\", IF($A22-1 < SUM('Link-Group'!B$2:'Link-Group'!B$6), \"IVC\", \"\")))))","v":"IVC"},"High",null,{"$f":"IF($A22-1 < 'Link-Group'!C$2, \"2W\", IF($A22-1 < 'Link-Group'!C$2+'Link-Group'!C$3, \"4W\", IF($A22-1 < SUM('Link-Group'!C$2:'Link-Group'!C$4), \"4WG\", IF($A22-1 < SUM('Link-Group'!C$2:'Link-Group'!C$5), \"SIP\", IF($A22-1 < SUM('Link-Group'!C$2:'Link-Group'!C$6), \"IVC\", \"\")))))","v":""},"High",null,{"$f":"IF($A22-1 < 'Link-Group'!D$2, \"2W\", IF($A22-1 < 'Link-Group'!D$2+'Link-Group'!D$3, \"4W\", IF($A22-1 < SUM('Link-Group'!D$2:'Link-Group'!D$4), \"4WG\", IF($A22-1 < SUM('Link-Group'!D$2:'Link-Group'!D$5), \"SIP\", IF($A22-1 < SUM('Link-Group'!D$2:'Link-Group'!D$6), \"IVC\", \"\")))))","v":""},"High",null,{"$f":"IF($A22-1 < 'Link-Group'!E$2, \"2W\", IF($A22-1 < 'Link-Group'!E$2+'Link-Group'!E$3, \"4W\", IF($A22-1 < SUM('Link-Group'!E$2:'Link-Group'!E$4), \"4WG\", IF($A22-1 < SUM('Link-Group'!E$2:'Link-Group'!E$5), \"SIP\", IF($A22-1 < SUM('Link-Group'!E$2:'Link-Group'!E$6), \"IVC\", \"\")))))","v":""},"High",null,{"$f":"IF($A22-1 < 'Link-Group'!F$2, \"2W\", IF($A22-1 < 'Link-Group'!F$2+'Link-Group'!F$3, \"4W\", IF($A22-1 < SUM('Link-Group'!F$2:'Link-Group'!F$4), \"4WG\", IF($A22-1 < SUM('Link-Group'!F$2:'Link-Group'!F$5), \"SIP\", IF($A22-1 < SUM('Link-Group'!F$2:'Link-Group'!F$6), \"IVC\", \"\")))))","v":""},"High",null,{"$f":"IF($A22-1 < 'Link-Group'!G$2, \"2W\", IF($A22-1 < 'Link-Group'!G$2+'Link-Group'!G$3, \"4W\", IF($A22-1 < SUM('Link-Group'!G$2:'Link-Group'!G$4), \"4WG\", IF($A22-1 < SUM('Link-Group'!G$2:'Link-Group'!G$5), \"SIP\", IF($A22-1 < SUM('Link-Group'!G$2:'Link-Group'!G$6), \"IVC\", \"\")))))","v":""},"High"]
[20,{"$f":"IF($A23-1 < 'Link-Group'!B$2, \"2W\", IF($A23-1 < 'Link-Group'!B$2+'Link-Group'!B$3, \"4W\", IF($A23-1 < SUM('Link-Group'!B$2:'Link-Group'!B$4), \"4WG\", IF($A23-1 < SUM('Link-Group'!B$2:'Link-Group'!B$5), \"SIP\", IF($A23-1 < SUM('Link-Group'!B$2:'Link-Group'!B$6), \"IVC\", \"\")))))","v":"IVC"},"High",null,{"$f":"IF($A23-1 < 'Link-Group'!C$2, \"2W\", IF($A23-1 < 'Link-Group'!C$2+'Link-Group'!C$3, \"4W\", IF($A23-1 < SUM('Link-Group'!C$2:'Link-Group'!C$4), \"4WG\", IF($A23-1 < SUM('Link-Group'!C$2:'Link-Group'!C$5), \"SIP\", IF($A23-1 < SUM('Link-Group'!C$2:'Link-Group'!C$6), \"IVC\", \"\")))))","v":""},"High",null,{"$f":"IF($A23-1 < 'Link-Group'!D$2, \"2W\", IF($A23-1 < 'Link-Group'!D$2+'Link-Group'!D$3, \"4W\", IF($A23-1 < SUM('Link-Group'!D$2:'Link-Group'!D$4), \"4WG\", IF($A23-1 < SUM('Link-Group'!D$2:'Link-Group'!D$5), \"SIP\", IF($A23-1 < SUM('Link-Group'!D$2:'Link-Group'!D$6), \"IVC\", \"\")))))","v":""},"High",null,{"$f":"IF($A23-1 < 'Link-Group'!E$2, \"2W\", IF($A23-1 < 'Link-Group'!E$2+'Link-Group'!E$3, \"4W\", IF($A23-1 < SUM('Link-Group'!E$2:'Link-Group'!E$4), \"4WG\", IF($A23-1 < SUM('Link-Group'!E$2:'Link-Group'!E$5), \"SIP\", IF($A23-1 < SUM('Link-Group'!E$2:'Link-Group'!E$6), \"IVC\", \"\")))))","v":""},"High",null,{"$f":"IF($A23-1 < 'Link-Group'!F$2, \"2W\", IF($A23-1 < 'Link-Group'!F$2+'Link-Group'!F$3, \"4W\", IF($A23-1 < SUM('Link-Group'!F$2:'Link-Group'!F$4), \"4WG\", IF($A23-1 < SUM('Link-Group'!F$2:'Link-Group'!F$5), \"SIP\", IF($A23-1 < SUM('Link-Group'!F$2:'Link-Group'!F$6), \"IVC\", \"\")))))","v":""},"High",null,{"$f":"IF($A23-1 < 'Link-Group'!G$2, \"2W\", IF($A23-1 < 'Link-Group'!G$2+'Link-Group'!G$3, \"4W\", IF($A23-1 < SUM('Link-Group'!G$2:'Link-Group'!G$4), \"4WG\", IF($A23-1 < SUM('Link-Group'!G$2:'Link-Group'!G$5), \"SIP\", IF($A23-1 < SUM('Link-Group'!G$2:'Link-Group'!G$6), \"IVC\", \"\")))))","v":""},"High"]
[21,{"$f":"IF($A24-1 < 'Link-Group'!B$2, \"2W\", IF($A24-1 < 'Link-Group'!B$2+'Link-Group'!B$3, \"4W\", IF($A24-1 < SUM('Link-Group'!B$2:'Link-Group'!B$4), \"4WG\", IF($A24-1 < SUM('Link-Group'!B$2:'Link-Group'!B$5), \"SIP\", IF($A24-1 < SUM('Link-Group'!B$2:'Link-Group'!B$6), \"IVC\", \"\")))))","v":"IVC"},"High",null,{"$f":"IF($A24-1 < 'Link-Group'!C$2, \"2W\", IF($A24-1 < 'Link-Group'!C$2+'Link-Group'!C$3, \"4W\", IF($A24-1 < SUM('Link-Group'!C$2:'Link-Group'!C$4), \"4WG\", IF($A24-1 < SUM('Link-Group'!C$2:'Link-Group'!C$5), \"SIP\", IF($A24-1 < SUM('Link-Group'!C$2:'Link-Group'!C$6), \"IVC\", \"\")))))","v":""},"High",null,{"$f":"IF($A24-1 < 'Link-Group'!D$2, \"2W\", IF($A24-1 < 'Link-Group'!D$2+'Link-Group'!D$3, \"4W\", IF($A24-1 < SUM('Link-Group'!D$2:'Link-Group'!D$4), \"4WG\", IF($A24-1 < SUM('Link-Group'!D$2:'Link-Group'!D$5), \"SIP\", IF($A24-1 < SUM('Link-Group'!D$2:'Link-Group'!D$6), \"IVC\", \"\")))))","v":""},"High",null,{"$f":"IF($A24-1 < 'Link-Group'!E$2, \"2W\", IF($A24-1 < 'Link-Group'!E$2+'Link-Group'!E$3, \"4W\", IF($A24-1 < SUM('Link-Group'!E$2:'Link-Group'!E$4), \"4WG\", IF($A24-1 < SUM('Link-Group'!E$2:'Link-Group'!E$5), \"SIP\", IF($A24-1 < SUM('Link-Group'!E$2:'Link-Group'!E$6), \"IVC\", \"\")))))","v":""},"High",null,{"$f":"IF($A24-1 < 'Link-Group'!F$2, \"2W\", IF($A24-1 < 'Link-Group'!F$2+'Link-Group'!F$3, \"4W\", IF($A24-1 < SUM('Link-Group'!F$2:'Link-Group'!F$4), \"4WG\", IF($A24-1 < SUM('Link-Group'!F$2:'Link-Group'!F$5), \"SIP\", IF($A24-1 < SUM('Link-Group'!F$2:'Link-Group'!F$6), \"IVC\", \"\")))))","v":""},"High",null,{"$f":"IF($A24-1 < 'Link-Group'!G$2, \"2W\", IF($A24-1 < 'Link-Group'!G$2+'Link-Group'!G$3, \"4W\", IF($A24-1 < SUM('Link-Group'!G$2:'Link-Group'!G$4), \"4WG\", IF($A24-1 < SUM('Link-Group'!G$2:'Link-Group'!G$5), \"SIP\", IF($A24-1 < SUM('Link-Group'!G$2:'Link-Group'!G$6), \"IVC\", \"\")))))","v":""},"High"]
[22,{"$f":"IF($A25-1 < 'Link-Group'!B$2, \"2W\", IF($A25-1 < 'Link-Group'!B$2+'Link-Group'!B$3, \"4W\", IF($A25-1 < SUM('Link-Group'!B$2:'Link-Group'!B$4), \"4WG\", IF($A25-1 < SUM('Link-Group'!B$2:'Link-Group'!B$5), \"SIP\", IF($A25-1 < SUM('Link-Group'!B$2:'Link-Group'!B$6), \"IVC\", \"\")))))","v":"IVC"},"High",null,{"$f":"IF($A25-1 < 'Link-Group'!C$2, \"2W\", IF($A25-1 < 'Link-Group'!C$2+'Link-Group'!C$3, \"4W\", IF($A25-1 < SUM('Link-Group'!C$2:'Link-Group'!C$4), \"4WG\", IF($A25-1 < SUM('Link-Group'!C$2:'Link-Group'!C$5), \"SIP\", IF($A25-1 < SUM('Link-Group'!C$2:'Link-Group'!C$6), \"IVC\", \"\")))))","v":""},"High",null,{"$f":"IF($A25-1 < 'Link-Group'!D$2, \"2W\", IF($A25-1 < 'Link-Group'!D$2+'Link-Group'!D$3, \"4W\", IF($A25-1 < SUM('Link-Group'!D$2:'Link-Group'!D$4), \"4WG\", IF($A25-1 < SUM('Link-Group'!D$2:'Link-Group'!D$5), \"SIP\", IF($A25-1 < SUM('Link-Group'!D$2:'Link-Group'!D$6), \"IVC\", \"\")))))","v":""},"High",null,{"$f":"IF($A25-1 < 'Link-Group'!E$2, \"2W\", IF($A25-1 < 'Link-Group'!E$2+'Link-Group'!E$3, \"4W\", IF($A25-1 < SUM('Link-Group'!E$2:'Link-Group'!E$4), \"4WG\", IF($A25-1 < SUM('Link-Group'!E$2:'Link-Group'!E$5), \"SIP\", IF($A25-1 < SUM('Link-Group'!E$2:'Link-Group'!E$6), \"IVC\", \"\")))))","v":""},"High",null,{"$f":"IF($A25-1 < 'Link-Group'!F$2, \"2W\", IF($A25-1 < 'Link-Group'!F$2+'Link-Group'!F$3, \"4W\", IF($A25-1 < SUM('Link-Group'!F$2:'Link-Group'!F$4), \"4WG\", IF($A25-1 < SUM('Link-Group'!F$2:'Link-Group'!F$5), \"SIP\", IF($A25-1 < SUM('Link-Group'!F$2:'Link-Group'!F$6), \"IVC\", \"\")))))","v":""},"High",null,{"$f":"IF($A25-1 < 'Link-Group'!G$2, \"2W\", IF($A25-1 < 'Link-Group'!G$2+'Link-Group'!G$3, \"4W\", IF($A25-1 < SUM('Link-Group'!G$2:'Link-Group'!G$4), \"4WG\", IF($A25-1 < SUM('Link-Group'!G$2:'Link-Group'!G$5), \"SIP\", IF($A25-1 < SUM('Link-Group'!G$2:'Link-Group'!G$6), \"IVC\", \"\")))))","v":""},"High"]
[23,{"$f":"IF($A26-1 < 'Link-Group'!B$2, \"2W\", IF($A26-1 < 'Link-Group'!B$2+'Link-Group'!B$3, \"4W\", IF($A26-1 < SUM('Link-Group'!B$2:'Link-Group'!B$4), \"4WG\", IF($A26-1 < SUM('Link-Group'!B$2:'Link-Group'!B$5), \"SIP\", IF($A26-1 < SUM('Link-Group'!B$2:'Link-Group'!B$6), \"IVC\", \"\")))))","v":"IVC"},"High",null,{"$f":"IF($A26-1 < 'Link-Group'!C$2, \"2W\", IF($A26-1 < 'Link-Group'!C$2+'Link-Group'!C$3, \"4W\", IF($A26-1 < SUM('Link-Group'!C$2:'Link-Group'!C$4), \"4WG\", IF($A26-1 < SUM('Link-Group'!C$2:'Link-Group'!C$5), \"SIP\", IF($A26-1 < SUM('Link-Group'!C$2:'Link-Group'!C$6), \"IVC\", \"\")))))","v":""},"High",null,{"$f":"IF($A26-1 < 'Link-Group'!D$2, \"2W\", IF($A26-1 < 'Link-Group'!D$2+'Link-Group'!D$3, \"4W\", IF($A26-1 < SUM('Link-Group'!D$2:'Link-Group'!D$4), \"4WG\", IF($A26-1 < SUM('Link-Group'!D$2:'Link-Group'!D$5), \"SIP\", IF($A26-1 < SUM('Link-Group'!D$2:'Link-Group'!D$6), \"IVC\", \"\")))))","v":""},"High",null,{"$f":"IF($A26-1 < 'Link-Group'!E$2, \"2W\", IF($A26-1 < 'Link-Group'!E$2+'Link-Group'!E$3, \"4W\", IF($A26-1 < SUM('Link-Group'!E$2:'Link-Group'!E$4), \"4WG\", IF($A26-1 < SUM('Link-Group'!E$2:'Link-Group'!E$5), \"SIP\", IF($A26-1 < SUM('Link-Group'!E$2:'Link-Group'!E$6), \"IVC\", \"\")))))","v":""},"High",null,{"$f":"IF($A26-1 < 'Link-Group'!F$2, \"2W\", IF($A26-1 < 'Link-Group'!F$2+'Link-Group'!F$3, \"4W\", IF($A26-1 < SUM('Link-Group'!F$2:'Link-Group'!F$4), \"4WG\", IF($A26-1 < SUM('Link-Group'!F$2:'Link-Group'!F$5), \"SIP\", IF($A26-1 < SUM('Link-Group'!F$2:'Link-Group'!F$6), \"IVC\", \"\")))))","v":""},"High",null,{"$f":"IF($A26-1 < 'Link-Group'!G$2, \"2W\", IF($A26-1 < 'Link-Group'!G$2+'Link-Group'!G$3, \"4W\", IF($A26-1 < SUM('Link-Group'!G$2:'Link-Group'!G$4), \"4WG\", IF($A26-1 < SUM('Link-Group'!G$2:'Link-Group'!G$5), \"SIP\", IF($A26-1 < SUM('Link-Group'!G$2:'Link-Group'!G$6), \"IVC\", \"\")))))","v":""},"High"]
[24,{"$f":"IF($A27-1 < 'Link-Group'!B$2, \"2W\", IF($A27-1 < 'Link-Group'!B$2+'Link-Group'!B$3, \"4W\", IF($A27-1 < SUM('Link-Group'!B$2:'Link-Group'!B$4), \"4WG\", IF($A27-1 < SUM('Link-Group'!B$2:'Link-Group'!B$5), \"SIP\", IF($A27-1 < SUM('Link-Group'!B$2:'Link-Group'!B$6), \"IVC\", \"\")))))","v":"IVC"},"High",null,{"$f":"IF($A27-1 < 'Link-Group'!C$2, \"2W\", IF($A27-1 < 'Link-Group'!C$2+'Link-Group'!C$3, \"4W\", IF($A27-1 < SUM('Link-Group'!C$2:'Link-Group'!C$4), \"4WG\", IF($A27-1 < SUM('Link-Group'!C$2:'Link-Group'!C$5), \"SIP\", IF($A27-1 < SUM('Link-Group'!C$2:'Link-Group'!C$6), \"IVC\", \"\")))))","v":""},"High",null,{"$f":"IF($A27-1 < 'Link-Group'!D$2, \"2W\", IF($A27-1 < 'Link-Group'!D$2+'Link-Group'!D$3, \"4W\", IF($A27-1 < SUM('Link-Group'!D$2:'Link-Group'!D$4), \"4WG\", IF($A27-1 < SUM('Link-Group'!D$2:'Link-Group'!D$5), \"SIP\", IF($A27-1 < SUM('Link-Group'!D$2:'Link-Group'!D$6), \"IVC\", \"\")))))","v":""},"High",null,{"$f":"IF($A27-1 < 'Link-Group'!E$2, \"2W\", IF($A27-1 < 'Link-Group'!E$2+'Link-Group'!E$3, \"4W\", IF($A27-1 < SUM('Link-Group'!E$2:'Link-Group'!E$4), \"4WG\", IF($A27-1 < SUM('Link-Group'!E$2:'Link-Group'!E$5), \"SIP\", IF($A27-1 < SUM('Link-Group'!E$2:'Link-Group'!E$6), \"IVC\", \"\")))))","v":""},"High",null,{"$f":"IF($A27-1 < 'Link-Group'!F$2, \"2W\", IF($A27-1 < 'Link-Group'!F$2+'Link-Group'!F$3, \"4W\", IF($A27-1 < SUM('Link-Group'!F$2:'Link-Group'!F$4), \"4WG\", IF($A27-1 < SUM('Link-Group'!F$2:'Link-Group'!F$5), \"SIP\", IF($A27-1 < SUM('Link-Group'!F$2:'Link-Group'!F$6), \"IVC\", \"\")))))","v":""},"High",null,{"$f":"IF($A27-1 < 'Link-Group'!G$2, \"2W\", IF($A27-1 < 'Link-Group'!G$2+'Link-Group'!G$3, \"4W\", IF($A27-1 < SUM('Link-Group'!G$2:'Link-Group'!G$4), \"4WG\", IF($A27-1 < SUM('Link-Group'!G$2:'Link-Group'!G$5), \"SIP\", IF($A27-1 < SUM('Link-Group'!G$2:'Link-Group'!G$6), \"IVC\", \"\")))))","v":""},"High"]
[]
[]
[]
[]
[]
[]
[]
[]
[]
[]
["DO NOT EDIT"]
[]
["Quality Cost","Link-Master","LQ 2","LQ 3","LQ 4","LQ 5","LQ 6",null,"Outgoing","Link-Master","LQ 2","LQ 3","LQ 4","LQ 5","LQ 6",null,"Incoming","Link-Master","LQ 2","LQ 3","LQ 4","LQ 5","LQ 6",null,"Internal","Link-Master","LQ 2","LQ 3","LQ 4","LQ 5","LQ 6"]
[1,{"$f":"IF(AND(B4<>\"\", D4<>\"\"),VLOOKUP(C4,Weights!$G$2:$H$6,2, 0),0)","v":0},{"$f":"IF(AND(E4<>\"\", G4<>\"\"),VLOOKUP(F4,Weights!$G$2:$H$6,2, 0),0)","v":0},{"$f":"IF(AND(H4<>\"\", J4<>\"\"),VLOOKUP(I4,Weights!$G$2:$H$6,2, 0),0)","v":0},{"$f":"IF(AND(K4<>\"\", M4<>\"\"),VLOOKUP(L4,Weights!$G$2:$H$6,2, 0),0)","v":0},{"$f":"IF(AND(N4<>\"\", P4<>\"\"),VLOOKUP(O4,Weights!$G$2:$H$6,2, 0),0)","v":0},{"$f":"IF(AND(Q4<>\"\", S4<>\"\"),VLOOKUP(R4,Weights!$G$2:$H$6,2, 0),0)","v":0},null,1,{"$f":"ComputeOutgoingCost(D4,B41,'Link-Group'!$B$7:$G$7,$D$4:$D$27, $G$4:$G$27,$J$4:$J$27,$M$4:$M$27,$P$4:$P$27,$S$4:$S$27)","v":0},{"$f":"ComputeOutgoingCost(G4,C41,'Link-Group'!$B$7:$G$7,$G$4:$G$27, $D$4:$D$27,$J$4:$J$27,$M$4:$M$27,$P$4:$P$27,$S$4:$S$27)","v":0},{"$f":"ComputeOutgoingCost(J4,D41,'Link-Group'!$B$7:$G$7, $J$4:$J$27, $D$4:$D$27,$G$4:$G$27,$M$4:$M$27,$P$4:$P$27,$S$4:$S$27)","v":0},{"$f":"ComputeOutgoingCost(M4,E41,'Link-Group'!$B$7:$G$7,$M$4:$M$27, $D$4:$D$27,$G$4:$G$27,$J$4:$J$27,$P$4:$P$27,$S$4:$S$27)","v":0},{"$f":"ComputeOutgoingCost(P4,F41,'Link-Group'!$B$7:$G$7, $P$4:$P$27, $D$4:$D$27,$G$4:$G$27,$J$4:$J$27,$M$4:$M$27,$S$4:$S$27)","v":0},{"$f":"ComputeOutgoingCost(S4,G41,'Link-Group'!$B$7:$G$7, $S$4:$S$27, $D$4:$D$27,$G$4:$G$27,$J$4:$J$27,$M$4:$M$27,$P$4:$P$27)","v":0},null,1,{"$f":"ComputeIncomingCost(D4, B41,'Link-Group'!$B$11, 'Link-Group'!B$7, $B$41:$G$64, $D$4:$D$27, $G$4:$G$27,$J$4:$J$27,$M$4:$M$27,$P$4:$P$27,$S$4:$S$27)","v":0},{"$f":"ComputeIncomingCost(G4, C41,'Link-Group'!$B$11, 'Link-Group'!C$7, $B$41:$G$64, $G$4:$G$27, $D$4:$D$27,$J$4:$J$27,$M$4:$M$27,$P$4:$P$27,$S$4:$S$27)","v":0},{"$f":"ComputeIncomingCost(J4, D41,'Link-Group'!$B$11, 'Link-Group'!D$7, $B$41:$G$64, $J$4:$J$27, $D$4:$D$27,$G$4:$G$27,$M$4:$M$27,$P$4:$P$27,$S$4:$S$27)","v":0},{"$f":"ComputeIncomingCost(M4, E41,'Link-Group'!$B$11, 'Link-Group'!E$7, $B$41:$G$64, $M$4:$M$27, $D$4:$D$27,$G$4:$G$27,$J$4:$J$27,$P$4:$P$27,$S$4:$S$27)","v":0},{"$f":"ComputeIncomingCost(P4, F41,'Link-Group'!$B$11, 'Link-Group'!F$7, $B$41:$G$64, $P$4:$P$27, $D$4:$D$27,$G$4:$G$27,$J$4:$J$27,$M$4:$M$27,$S$4:$S$27)","v":0},{"$f":"ComputeIncomingCost(S4, G41,'Link-Group'!$B$11, 'Link-Group'!G$7, $B$41:$G$64, $S$4:$S$27, $D$4:$D$27,$G$4:$G$27,$J$4:$J$27,$M$4:$M$27,$P$4:$P$27)","v":0},null,1,{"$f":"ComputeInternalCost(D4, B41, 'Link-Group'!$B$11, $B$41:$G$64, $D$4:$D$27, $G$4:$G$27,$J$4:$J$27,$M$4:$M$27,$P$4:$P$27,$S$4:$S$27)","v":0},{"$f":"ComputeInternalCost(G4, C41, 'Link-Group'!$B$11, $B$41:$G$64, $G$4:$G$27, $D$4:$D$27,$J$4:$J$27,$M$4:$M$27,$P$4:$P$27,$S$4:$S$27)","v":0},{"$f":"ComputeInternalCost(J4, D41, 'Link-Group'!$B$11, $B$41:$G$64, $J$4:$J$27, $D$4:$D$27,$G$4:$G$27,$M$4:$M$27,$P$4:$P$27,$S$4:$S$27)","v":0},{"$f":"ComputeInternalCost(M4, E41, 'Link-Group'!$B$11, $B$41:$G$64, $M$4:$M$27, $D$4:$D$27,$G$4:$G$27,$J$4:$J$27,$P$4:$P$27,$S$4:$S$27)","v":0},{"$f":"ComputeInternalCost(P4, F41, 'Link-Group'!$B$11, $B$41:$G$64, $P$4:$P$27, $D$4:$D$27,$G$4:$G$27,$J$4:$J$27,$M$4:$M$27,$S$4:$S$27)","v":0},{"$f":"ComputeInternalCost(S4, G41, 'Link-Group'!$B$11, $B$41:$G$64, $S$4:$S$27, $D$4:$D$27,$G$4:$G$27,$J$4:$J$27,$M$4:$M$27,$P$4:$P$27)","v":0}]
[2,{"$f":"IF(AND(B5<>\"\", D5<>\"\"),VLOOKUP(C5,Weights!$G$2:$H$6,2, 0),0)","v":0},{"$f":"IF(AND(E5<>\"\", G5<>\"\"),VLOOKUP(F5,Weights!$G$2:$H$6,2, 0),0)","v":0},{"$f":"IF(AND(H5<>\"\", J5<>\"\"),VLOOKUP(I5,Weights!$G$2:$H$6,2, 0),0)","v":0},{"$f":"IF(AND(K5<>\"\", M5<>\"\"),VLOOKUP(L5,Weights!$G$2:$H$6,2, 0),0)","v":0},{"$f":"IF(AND(N5<>\"\", P5<>\"\"),VLOOKUP(O5,Weights!$G$2:$H$6,2, 0),0)","v":0},{"$f":"IF(AND(Q5<>\"\", S5<>\"\"),VLOOKUP(R5,Weights!$G$2:$H$6,2, 0),0)","v":0},null,2,{"$f":"ComputeOutgoingCost(D5,B42,'Link-Group'!$B$7:$G$7,$D$4:$D$27, $G$4:$G$27,$J$4:$J$27,$M$4:$M$27,$P$4:$P$27,$S$4:$S$27)","v":0},{"$f":"ComputeOutgoingCost(G5,C42,'Link-Group'!$B$7:$G$7,$G$4:$G$27, $D$4:$D$27,$J$4:$J$27,$M$4:$M$27,$P$4:$P$27,$S$4:$S$27)","v":0},{"$f":"ComputeOutgoingCost(J5,D42,'Link-Group'!$B$7:$G$7, $J$4:$J$27, $D$4:$D$27,$G$4:$G$27,$M$4:$M$27,$P$4:$P$27,$S$4:$S$27)","v":0},{"$f":"ComputeOutgoingCost(M5,E42,'Link-Group'!$B$7:$G$7,$M$4:$M$27, $D$4:$D$27,$G$4:$G$27,$J$4:$J$27,$P$4:$P$27,$S$4:$S$27)","v":0},{"$f":"ComputeOutgoingCost(P5,F42,'Link-Group'!$B$7:$G$7, $P$4:$P$27, $D$4:$D$27,$G$4:$G$27,$J$4:$J$27,$M$4:$M$27,$S$4:$S$27)","v":0},{"$f":"ComputeOutgoingCost(S5,G42,'Link-Group'!$B$7:$G$7, $S$4:$S$27, $D$4:$D$27,$G$4:$G$27,$J$4:$J$27,$M$4:$M$27,$P$4:$P$27)","v":0},null,2,{"$f":"ComputeIncomingCost(D5, B42,'Link-Group'!$B$11, 'Link-Group'!B$7, $B$41:$G$64, $D$4:$D$27, $G$4:$G$27,$J$4:$J$27,$M$4:$M$27,$P$4:$P$27,$S$4:$S$27)","v":0},{"$f":"ComputeIncomingCost(G5, C42,'Link-Group'!$B$11, 'Link-Group'!C$7, $B$41:$G$64, $G$4:$G$27, $D$4:$D$27,$J$4:$J$27,$M$4:$M$27,$P$4:$P$27,$S$4:$S$27)","v":0},{"$f":"ComputeIncomingCost(J5, D42,'Link-Group'!$B$11, 'Link-Group'!D$7, $B$41:$G$64, $J$4:$J$27, $D$4:$D$27,$G$4:$G$27,$M$4:$M$27,$P$4:$P$27,$S$4:$S$27)","v":0},{"$f":"ComputeIncomingCost(M5, E42,'Link-Group'!$B$11, 'Link-Group'!E$7, $B$41:$G$64, $M$4:$M$27, $D$4:$D$27,$G$4:$G$27,$J$4:$J$27,$P$4:$P$27,$S$4:$S$27)","v":0},{"$f":"ComputeIncomingCost(P5, F42,'Link-Group'!$B$11, 'Link-Group'!F$7, $B$41:$G$64, $P$4:$P$27, $D$4:$D$27,$G$4:$G$27,$J$4:$J$27,$M$4:$M$27,$S$4:$S$27)","v":0},{"$f":"ComputeIncomingCost(S5, G42,'Link-Group'!$B$11, 'Link-Group'!G$7, $B$41:$G$64, $S$4:$S$27, $D$4:$D$27,$G$4:$G$27,$J$4:$J$27,$M$4:$M$27,$P$4:$P$27)","v":0},null,2,{"$f":"ComputeInternalCost(D5, B42, 'Link-Group'!$B$11, $B$41:$G$64, $D$4:$D$27, $G$4:$G$27,$J$4:$J$27,$M$4:$M$27,$P$4:$P$27,$S$4:$S$27)","v":0},{"$f":"ComputeInternalCost(G5, C42, 'Link-Group'!$B$11, $B$41:$G$64, $G$4:$G$27, $D$4:$D$27,$J$4:$J$27,$M$4:$M$27,$P$4:$P$27,$S$4:$S$27)","v":0},{"$f":"ComputeInternalCost(J5, D42, 'Link-Group'!$B$11, $B$41:$G$64, $J$4:$J$27, $D$4:$D$27,$G$4:$G$27,$M$4:$M$27,$P$4:$P$27,$S$4:$S$27)","v":0},{"$f":"ComputeInternalCost(M5, E42, 'Link-Group'!$B$11, $B$41:$G$64, $M$4:$M$27, $D$4:$D$27,$G$4:$G$27,$J$4:$J$27,$P$4:$P$27,$S$4:$S$27)","v":0},{"$f":"ComputeInternalCost(P5, F42, 'Link-Group'!$B$11, $B$41:$G$64, $P$4:$P$27, $D$4:$D$27,$G$4:$G$27,$J$4:$J$27,$M$4:$M$27,$S$4:$S$27)","v":0},{"$f":"ComputeInternalCost(S5, G42, 'Link-Group'!$B$11, $B$41:$G$64, $S$4:$S$27, $D$4:$D$27,$G$4:$G$27,$J$4:$J$27,$M$4:$M$27,$P$4:$P$27)","v":0}]
[3,{"$f":"IF(AND(B6<>\"\", D6<>\"\"),VLOOKUP(C6,Weights!$G$2:$H$6,2, 0),0)","v":0},{"$f":"IF(AND(E6<>\"\", G6<>\"\"),VLOOKUP(F6,Weights!$G$2:$H$6,2, 0),0)","v":0},{"$f":"IF(AND(H6<>\"\", J6<>\"\"),VLOOKUP(I6,Weights!$G$2:$H$6,2, 0),0)","v":0},{"$f":"IF(AND(K6<>\"\", M6<>\"\"),VLOOKUP(L6,Weights!$G$2:$H$6,2, 0),0)","v":0},{"$f":"IF(AND(N6<>\"\", P6<>\"\"),VLOOKUP(O6,Weights!$G$2:$H$6,2, 0),0)","v":0},{"$f":"IF(AND(Q6<>\"\", S6<>\"\"),VLOOKUP(R6,Weights!$G$2:$H$6,2, 0),0)","v":0},null,3,{"$f":"ComputeOutgoingCost(D6,B43,'Link-Group'!$B$7:$G$7,$D$4:$D$27, $G$4:$G$27,$J$4:$J$27,$M$4:$M$27,$P$4:$P$27,$S$4:$S$27)","v":0},{"$f":"ComputeOutgoingCost(G6,C43,'Link-Group'!$B$7:$G$7,$G$4:$G$27, $D$4:$D$27,$J$4:$J$27,$M$4:$M$27,$P$4:$P$27,$S$4:$S$27)","v":0},{"$f":"ComputeOutgoingCost(J6,D43,'Link-Group'!$B$7:$G$7, $J$4:$J$27, $D$4:$D$27,$G$4:$G$27,$M$4:$M$27,$P$4:$P$27,$S$4:$S$27)","v":0},{"$f":"ComputeOutgoingCost(M6,E43,'Link-Group'!$B$7:$G$7,$M$4:$M$27, $D$4:$D$27,$G$4:$G$27,$J$4:$J$27,$P$4:$P$27,$S$4:$S$27)","v":0},{"$f":"ComputeOutgoingCost(P6,F43,'Link-Group'!$B$7:$G$7, $P$4:$P$27, $D$4:$D$27,$G$4:$G$27,$J$4:$J$27,$M$4:$M$27,$S$4:$S$27)","v":0},{"$f":"ComputeOutgoingCost(S6,G43,'Link-Group'!$B$7:$G$7, $S$4:$S$27, $D$4:$D$27,$G$4:$G$27,$J$4:$J$27,$M$4:$M$27,$P$4:$P$27)","v":0},null,3,{"$f":"ComputeIncomingCost(D6, B43,'Link-Group'!$B$11, 'Link-Group'!B$7, $B$41:$G$64, $D$4:$D$27, $G$4:$G$27,$J$4:$J$27,$M$4:$M$27,$P$4:$P$27,$S$4:$S$27)","v":0},{"$f":"ComputeIncomingCost(G6, C43,'Link-Group'!$B$11, 'Link-Group'!C$7, $B$41:$G$64, $G$4:$G$27, $D$4:$D$27,$J$4:$J$27,$M$4:$M$27,$P$4:$P$27,$S$4:$S$27)","v":0},{"$f":"ComputeIncomingCost(J6, D43,'Link-Group'!$B$11, 'Link-Group'!D$7, $B$41:$G$64, $J$4:$J$27, $D$4:$D$27,$G$4:$G$27,$M$4:$M$27,$P$4:$P$27,$S$4:$S$27)","v":0},{"$f":"ComputeIncomingCost(M6, E43,'Link-Group'!$B$11, 'Link-Group'!E$7, $B$41:$G$64, $M$4:$M$27, $D$4:$D$27,$G$4:$G$27,$J$4:$J$27,$P$4:$P$27,$S$4:$S$27)","v":0},{"$f":"ComputeIncomingCost(P6, F43,'Link-Group'!$B$11, 'Link-Group'!F$7, $B$41:$G$64, $P$4:$P$27, $D$4:$D$27,$G$4:$G$27,$J$4:$J$27,$M$4:$M$27,$S$4:$S$27)","v":0},{"$f":"ComputeIncomingCost(S6, G43,'Link-Group'!$B$11, 'Link-Group'!G$7, $B$41:$G$64, $S$4:$S$27, $D$4:$D$27,$G$4:$G$27,$J$4:$J$27,$M$4:$M$27,$P$4:$P$27)","v":0},null,3,{"$f":"ComputeInternalCost(D6, B43, 'Link-Group'!$B$11, $B$41:$G$64, $D$4:$D$27, $G$4:$G$27,$J$4:$J$27,$M$4:$M$27,$P$4:$P$27,$S$4:$S$27)","v":0},{"$f":"ComputeInternalCost(G6, C43, 'Link-Group'!$B$11, $B$41:$G$64, $G$4:$G$27, $D$4:$D$27,$J$4:$J$27,$M$4:$M$27,$P$4:$P$27,$S$4:$S$27)","v":0},{"$f":"ComputeInternalCost(J6, D43, 'Link-Group'!$B$11, $B$41:$G$64, $J$4:$J$27, $D$4:$D$27,$G$4:$G$27,$M$4:$M$27,$P$4:$P$27,$S$4:$S$27)","v":0},{"$f":"ComputeInternalCost(M6, E43, 'Link-Group'!$B$11, $B$41:$G$64, $M$4:$M$27, $D$4:$D$27,$G$4:$G$27,$J$4:$J$27,$P$4:$P$27,$S$4:$S$27)","v":0},{"$f":"ComputeInternalCost(P6, F43, 'Link-Group'!$B$11, $B$41:$G$64, $P$4:$P$27, $D$4:$D$27,$G$4:$G$27,$J$4:$J$27,$M$4:$M$27,$S$4:$S$27)","v":0},{"$f":"ComputeInternalCost(S6, G43, 'Link-Group'!$B$11, $B$41:$G$64, $S$4:$S$27, $D$4:$D$27,$G$4:$G$27,$J$4:$J$27,$M$4:$M$27,$P$4:$P$27)","v":0}]
[4,{"$f":"IF(AND(B7<>\"\", D7<>\"\"),VLOOKUP(C7,Weights!$G$2:$H$6,2, 0),0)","v":0},{"$f":"IF(AND(E7<>\"\", G7<>\"\"),VLOOKUP(F7,Weights!$G$2:$H$6,2, 0),0)","v":0},{"$f":"IF(AND(H7<>\"\", J7<>\"\"),VLOOKUP(I7,Weights!$G$2:$H$6,2, 0),0)","v":0},{"$f":"IF(AND(K7<>\"\", M7<>\"\"),VLOOKUP(L7,Weights!$G$2:$H$6,2, 0),0)","v":0},{"$f":"IF(AND(N7<>\"\", P7<>\"\"),VLOOKUP(O7,Weights!$G$2:$H$6,2, 0),0)","v":0},{"$f":"IF(AND(Q7<>\"\", S7<>\"\"),VLOOKUP(R7,Weights!$G$2:$H$6,2, 0),0)","v":0},null,4,{"$f":"ComputeOutgoingCost(D7,B44,'Link-Group'!$B$7:$G$7,$D$4:$D$27, $G$4:$G$27,$J$4:$J$27,$M$4:$M$27,$P$4:$P$27,$S$4:$S$27)","v":0},{"$f":"ComputeOutgoingCost(G7,C44,'Link-Group'!$B$7:$G$7,$G$4:$G$27, $D$4:$D$27,$J$4:$J$27,$M$4:$M$27,$P$4:$P$27,$S$4:$S$27)","v":0},{"$f":"ComputeOutgoingCost(J7,D44,'Link-Group'!$B$7:$G$7, $J$4:$J$27, $D$4:$D$27,$G$4:$G$27,$M$4:$M$27,$P$4:$P$27,$S$4:$S$27)","v":0},{"$f":"ComputeOutgoingCost(M7,E44,'Link-Group'!$B$7:$G$7,$M$4:$M$27, $D$4:$D$27,$G$4:$G$27,$J$4:$J$27,$P$4:$P$27,$S$4:$S$27)","v":0},{"$f":"ComputeOutgoingCost(P7,F44,'Link-Group'!$B$7:$G$7, $P$4:$P$27, $D$4:$D$27,$G$4:$G$27,$J$4:$J$27,$M$4:$M$27,$S$4:$S$27)","v":0},{"$f":"ComputeOutgoingCost(S7,G44,'Link-Group'!$B$7:$G$7, $S$4:$S$27, $D$4:$D$27,$G$4:$G$27,$J$4:$J$27,$M$4:$M$27,$P$4:$P$27)","v":0},null,4,{"$f":"ComputeIncomingCost(D7, B44,'Link-Group'!$B$11, 'Link-Group'!B$7, $B$41:$G$64, $D$4:$D$27, $G$4:$G$27,$J$4:$J$27,$M$4:$M$27,$P$4:$P$27,$S$4:$S$27)","v":0},{"$f":"ComputeIncomingCost(G7, C44,'Link-Group'!$B$11, 'Link-Group'!C$7, $B$41:$G$64, $G$4:$G$27, $D$4:$D$27,$J$4:$J$27,$M$4:$M$27,$P$4:$P$27,$S$4:$S$27)","v":0},{"$f":"ComputeIncomingCost(J7, D44,'Link-Group'!$B$11, 'Link-Group'!D$7, $B$41:$G$64, $J$4:$J$27, $D$4:$D$27,$G$4:$G$27,$M$4:$M$27,$P$4:$P$27,$S$4:$S$27)","v":0},{"$f":"ComputeIncomingCost(M7, E44,'Link-Group'!$B$11, 'Link-Group'!E$7, $B$41:$G$64, $M$4:$M$27, $D$4:$D$27,$G$4:$G$27,$J$4:$J$27,$P$4:$P$27,$S$4:$S$27)","v":0},{"$f":"ComputeIncomingCost(P7, F44,'Link-Group'!$B$11, 'Link-Group'!F$7, $B$41:$G$64, $P$4:$P$27, $D$4:$D$27,$G$4:$G$27,$J$4:$J$27,$M$4:$M$27,$S$4:$S$27)","v":0},{"$f":"ComputeIncomingCost(S7, G44,'Link-Group'!$B$11, 'Link-Group'!G$7, $B$41:$G$64, $S$4:$S$27, $D$4:$D$27,$G$4:$G$27,$J$4:$J$27,$M$4:$M$27,$P$4:$P$27)","v":0},null,4,{"$f":"ComputeInternalCost(D7, B44, 'Link-Group'!$B$11, $B$41:$G$64, $D$4:$D$27, $G$4:$G$27,$J$4:$J$27,$M$4:$M$27,$P$4:$P$27,$S$4:$S$27)","v":0},{"$f":"ComputeInternalCost(G7, C44, 'Link-Group'!$B$11, $B$41:$G$64, $G$4:$G$27, $D$4:$D$27,$J$4:$J$27,$M$4:$M$27,$P$4:$P$27,$S$4:$S$27)","v":0},{"$f":"ComputeInternalCost(J7, D44, 'Link-Group'!$B$11, $B$41:$G$64, $J$4:$J$27, $D$4:$D$27,$G$4:$G$27,$M$4:$M$27,$P$4:$P$27,$S$4:$S$27)","v":0},{"$f":"ComputeInternalCost(M7, E44, 'Link-Group'!$B$11, $B$41:$G$64, $M$4:$M$27, $D$4:$D$27,$G$4:$G$27,$J$4:$J$27,$P$4:$P$27,$S$4:$S$27)","v":0},{"$f":"ComputeInternalCost(P7, F44, 'Link-Group'!$B$11, $B$41:$G$64, $P$4:$P$27, $D$4:$D$27,$G$4:$G$27,$J$4:$J$27,$M$4:$M$27,$S$4:$S$27)","v":0},{"$f":"ComputeInternalCost(S7, G44, 'Link-Group'!$B$11, $B$41:$G$64, $S$4:$S$27, $D$4:$D$27,$G$4:$G$27,$J$4:$J$27,$M$4:$M$27,$P$4:$P$27)","v":0}]
[5,{"$f":"IF(AND(B8<>\"\", D8<>\"\"),VLOOKUP(C8,Weights!$G$2:$H$6,2, 0),0)","v":0},{"$f":"IF(AND(E8<>\"\", G8<>\"\"),VLOOKUP(F8,Weights!$G$2:$H$6,2, 0),0)","v":0},{"$f":"IF(AND(H8<>\"\", J8<>\"\"),VLOOKUP(I8,Weights!$G$2:$H$6,2, 0),0)","v":0},{"$f":"IF(AND(K8<>\"\", M8<>\"\"),VLOOKUP(L8,Weights!$G$2:$H$6,2, 0),0)","v":0},{"$f":"IF(AND(N8<>\"\", P8<>\"\"),VLOOKUP(O8,Weights!$G$2:$H$6,2, 0),0)","v":0},{"$f":"IF(AND(Q8<>\"\", S8<>\"\"),VLOOKUP(R8,Weights!$G$2:$H$6,2, 0),0)","v":0},null,5,{"$f":"ComputeOutgoingCost(D8,B45,'Link-Group'!$B$7:$G$7,$D$4:$D$27, $G$4:$G$27,$J$4:$J$27,$M$4:$M$27,$P$4:$P$27,$S$4:$S$27)","v":0},{"$f":"ComputeOutgoingCost(G8,C45,'Link-Group'!$B$7:$G$7,$G$4:$G$27, $D$4:$D$27,$J$4:$J$27,$M$4:$M$27,$P$4:$P$27,$S$4:$S$27)","v":0},{"$f":"ComputeOutgoingCost(J8,D45,'Link-Group'!$B$7:$G$7, $J$4:$J$27, $D$4:$D$27,$G$4:$G$27,$M$4:$M$27,$P$4:$P$27,$S$4:$S$27)","v":0},{"$f":"ComputeOutgoingCost(M8,E45,'Link-Group'!$B$7:$G$7,$M$4:$M$27, $D$4:$D$27,$G$4:$G$27,$J$4:$J$27,$P$4:$P$27,$S$4:$S$27)","v":0},{"$f":"ComputeOutgoingCost(P8,F45,'Link-Group'!$B$7:$G$7, $P$4:$P$27, $D$4:$D$27,$G$4:$G$27,$J$4:$J$27,$M$4:$M$27,$S$4:$S$27)","v":0},{"$f":"ComputeOutgoingCost(S8,G45,'Link-Group'!$B$7:$G$7, $S$4:$S$27, $D$4:$D$27,$G$4:$G$27,$J$4:$J$27,$M$4:$M$27,$P$4:$P$27)","v":0},null,5,{"$f":"ComputeIncomingCost(D8, B45,'Link-Group'!$B$11, 'Link-Group'!B$7, $B$41:$G$64, $D$4:$D$27, $G$4:$G$27,$J$4:$J$27,$M$4:$M$27,$P$4:$P$27,$S$4:$S$27)","v":0},{"$f":"ComputeIncomingCost(G8, C45,'Link-Group'!$B$11, 'Link-Group'!C$7, $B$41:$G$64, $G$4:$G$27, $D$4:$D$27,$J$4:$J$27,$M$4:$M$27,$P$4:$P$27,$S$4:$S$27)","v":0},{"$f":"ComputeIncomingCost(J8, D45,'Link-Group'!$B$11, 'Link-Group'!D$7, $B$41:$G$64, $J$4:$J$27, $D$4:$D$27,$G$4:$G$27,$M$4:$M$27,$P$4:$P$27,$S$4:$S$27)","v":0},{"$f":"ComputeIncomingCost(M8, E45,'Link-Group'!$B$11, 'Link-Group'!E$7, $B$41:$G$64, $M$4:$M$27, $D$4:$D$27,$G$4:$G$27,$J$4:$J$27,$P$4:$P$27,$S$4:$S$27)","v":0},{"$f":"ComputeIncomingCost(P8, F45,'Link-Group'!$B$11, 'Link-Group'!F$7, $B$41:$G$64, $P$4:$P$27, $D$4:$D$27,$G$4:$G$27,$J$4:$J$27,$M$4:$M$27,$S$4:$S$27)","v":0},{"$f":"ComputeIncomingCost(S8, G45,'Link-Group'!$B$11, 'Link-Group'!G$7, $B$41:$G$64, $S$4:$S$27, $D$4:$D$27,$G$4:$G$27,$J$4:$J$27,$M$4:$M$27,$P$4:$P$27)","v":0},null,5,{"$f":"ComputeInternalCost(D8, B45, 'Link-Group'!$B$11, $B$41:$G$64, $D$4:$D$27, $G$4:$G$27,$J$4:$J$27,$M$4:$M$27,$P$4:$P$27,$S$4:$S$27)","v":0},{"$f":"ComputeInternalCost(G8, C45, 'Link-Group'!$B$11, $B$41:$G$64, $G$4:$G$27, $D$4:$D$27,$J$4:$J$27,$M$4:$M$27,$P$4:$P$27,$S$4:$S$27)","v":0},{"$f":"ComputeInternalCost(J8, D45, 'Link-Group'!$B$11, $B$41:$G$64, $J$4:$J$27, $D$4:$D$27,$G$4:$G$27,$M$4:$M$27,$P$4:$P$27,$S$4:$S$27)","v":0},{"$f":"ComputeInternalCost(M8, E45, 'Link-Group'!$B$11, $B$41:$G$64, $M$4:$M$27, $D$4:$D$27,$G$4:$G$27,$J$4:$J$27,$P$4:$P$27,$S$4:$S$27)","v":0},{"$f":"ComputeInternalCost(P8, F45, 'Link-Group'!$B$11, $B$41:$G$64, $P$4:$P$27, $D$4:$D$27,$G$4:$G$27,$J$4:$J$27,$M$4:$M$27,$S$4:$S$27)","v":0},{"$f":"ComputeInternalCost(S8, G45, 'Link-Group'!$B$11, $B$41:$G$64, $S$4:$S$27, $D$4:$D$27,$G$4:$G$27,$J$4:$J$27,$M$4:$M$27,$P$4:$P$27)","v":0}]
[6,{"$f":"IF(AND(B9<>\"\", D9<>\"\"),VLOOKUP(C9,Weights!$G$2:$H$6,2, 0),0)","v":0},{"$f":"IF(AND(E9<>\"\", G9<>\"\"),VLOOKUP(F9,Weights!$G$2:$H$6,2, 0),0)","v":0},{"$f":"IF(AND(H9<>\"\", J9<>\"\"),VLOOKUP(I9,Weights!$G$2:$H$6,2, 0),0)","v":0},{"$f":"IF(AND(K9<>\"\", M9<>\"\"),VLOOKUP(L9,Weights!$G$2:$H$6,2, 0),0)","v":0},{"$f":"IF(AND(N9<>\"\", P9<>\"\"),VLOOKUP(O9,Weights!$G$2:$H$6,2, 0),0)","v":0},{"$f":"IF(AND(Q9<>\"\", S9<>\"\"),VLOOKUP(R9,Weights!$G$2:$H$6,2, 0),0)","v":0},null,6,{"$f":"ComputeOutgoingCost(D9,B46,'Link-Group'!$B$7:$G$7,$D$4:$D$27, $G$4:$G$27,$J$4:$J$27,$M$4:$M$27,$P$4:$P$27,$S$4:$S$27)","v":0},{"$f":"ComputeOutgoingCost(G9,C46,'Link-Group'!$B$7:$G$7,$G$4:$G$27, $D$4:$D$27,$J$4:$J$27,$M$4:$M$27,$P$4:$P$27,$S$4:$S$27)","v":0},{"$f":"ComputeOutgoingCost(J9,D46,'Link-Group'!$B$7:$G$7, $J$4:$J$27, $D$4:$D$27,$G$4:$G$27,$M$4:$M$27,$P$4:$P$27,$S$4:$S$27)","v":0},{"$f":"ComputeOutgoingCost(M9,E46,'Link-Group'!$B$7:$G$7,$M$4:$M$27, $D$4:$D$27,$G$4:$G$27,$J$4:$J$27,$P$4:$P$27,$S$4:$S$27)","v":0},{"$f":"ComputeOutgoingCost(P9,F46,'Link-Group'!$B$7:$G$7, $P$4:$P$27, $D$4:$D$27,$G$4:$G$27,$J$4:$J$27,$M$4:$M$27,$S$4:$S$27)","v":0},{"$f":"ComputeOutgoingCost(S9,G46,'Link-Group'!$B$7:$G$7, $S$4:$S$27, $D$4:$D$27,$G$4:$G$27,$J$4:$J$27,$M$4:$M$27,$P$4:$P$27)","v":0},null,6,{"$f":"ComputeIncomingCost(D9, B46,'Link-Group'!$B$11, 'Link-Group'!B$7, $B$41:$G$64, $D$4:$D$27, $G$4:$G$27,$J$4:$J$27,$M$4:$M$27,$P$4:$P$27,$S$4:$S$27)","v":0},{"$f":"ComputeIncomingCost(G9, C46,'Link-Group'!$B$11, 'Link-Group'!C$7, $B$41:$G$64, $G$4:$G$27, $D$4:$D$27,$J$4:$J$27,$M$4:$M$27,$P$4:$P$27,$S$4:$S$27)","v":0},{"$f":"ComputeIncomingCost(J9, D46,'Link-Group'!$B$11, 'Link-Group'!D$7, $B$41:$G$64, $J$4:$J$27, $D$4:$D$27,$G$4:$G$27,$M$4:$M$27,$P$4:$P$27,$S$4:$S$27)","v":0},{"$f":"ComputeIncomingCost(M9, E46,'Link-Group'!$B$11, 'Link-Group'!E$7, $B$41:$G$64, $M$4:$M$27, $D$4:$D$27,$G$4:$G$27,$J$4:$J$27,$P$4:$P$27,$S$4:$S$27)","v":0},{"$f":"ComputeIncomingCost(P9, F46,'Link-Group'!$B$11, 'Link-Group'!F$7, $B$41:$G$64, $P$4:$P$27, $D$4:$D$27,$G$4:$G$27,$J$4:$J$27,$M$4:$M$27,$S$4:$S$27)","v":0},{"$f":"ComputeIncomingCost(S9, G46,'Link-Group'!$B$11, 'Link-Group'!G$7, $B$41:$G$64, $S$4:$S$27, $D$4:$D$27,$G$4:$G$27,$J$4:$J$27,$M$4:$M$27,$P$4:$P$27)","v":0},null,6,{"$f":"ComputeInternalCost(D9, B46, 'Link-Group'!$B$11, $B$41:$G$64, $D$4:$D$27, $G$4:$G$27,$J$4:$J$27,$M$4:$M$27,$P$4:$P$27,$S$4:$S$27)","v":0},{"$f":"ComputeInternalCost(G9, C46, 'Link-Group'!$B$11, $B$41:$G$64, $G$4:$G$27, $D$4:$D$27,$J$4:$J$27,$M$4:$M$27,$P$4:$P$27,$S$4:$S$27)","v":0},{"$f":"ComputeInternalCost(J9, D46, 'Link-Group'!$B$11, $B$41:$G$64, $J$4:$J$27, $D$4:$D$27,$G$4:$G$27,$M$4:$M$27,$P$4:$P$27,$S$4:$S$27)","v":0},{"$f":"ComputeInternalCost(M9, E46, 'Link-Group'!$B$11, $B$41:$G$64, $M$4:$M$27, $D$4:$D$27,$G$4:$G$27,$J$4:$J$27,$P$4:$P$27,$S$4:$S$27)","v":0},{"$f":"ComputeInternalCost(P9, F46, 'Link-Group'!$B$11, $B$41:$G$64, $P$4:$P$27, $D$4:$D$27,$G$4:$G$27,$J$4:$J$27,$M$4:$M$27,$S$4:$S$27)","v":0},{"$f":"ComputeInternalCost(S9, G46, 'Link-Group'!$B$11, $B$41:$G$64, $S$4:$S$27, $D$4:$D$27,$G$4:$G$27,$J$4:$J$27,$M$4:$M$27,$P$4:$P$27)","v":0}]
[7,{"$f":"IF(AND(B10<>\"\", D10<>\"\"),VLOOKUP(C10,Weights!$G$2:$H$6,2, 0),0)","v":0},{"$f":"IF(AND(E10<>\"\", G10<>\"\"),VLOOKUP(F10,Weights!$G$2:$H$6,2, 0),0)","v":0},{"$f":"IF(AND(H10<>\"\", J10<>\"\"),VLOOKUP(I10,Weights!$G$2:$H$6,2, 0),0)","v":0},{"$f":"IF(AND(K10<>\"\", M10<>\"\"),VLOOKUP(L10,Weights!$G$2:$H$6,2, 0),0)","v":0},{"$f":"IF(AND(N10<>\"\", P10<>\"\"),VLOOKUP(O10,Weights!$G$2:$H$6,2, 0),0)","v":0},{"$f":"IF(AND(Q10<>\"\", S10<>\"\"),VLOOKUP(R10,Weights!$G$2:$H$6,2, 0),0)","v":0},null,7,{"$f":"ComputeOutgoingCost(D10,B47,'Link-Group'!$B$7:$G$7,$D$4:$D$27, $G$4:$G$27,$J$4:$J$27,$M$4:$M$27,$P$4:$P$27,$S$4:$S$27)","v":0},{"$f":"ComputeOutgoingCost(G10,C47,'Link-Group'!$B$7:$G$7,$G$4:$G$27, $D$4:$D$27,$J$4:$J$27,$M$4:$M$27,$P$4:$P$27,$S$4:$S$27)","v":0},{"$f":"ComputeOutgoingCost(J10,D47,'Link-Group'!$B$7:$G$7, $J$4:$J$27, $D$4:$D$27,$G$4:$G$27,$M$4:$M$27,$P$4:$P$27,$S$4:$S$27)","v":0},{"$f":"ComputeOutgoingCost(M10,E47,'Link-Group'!$B$7:$G$7,$M$4:$M$27, $D$4:$D$27,$G$4:$G$27,$J$4:$J$27,$P$4:$P$27,$S$4:$S$27)","v":0},{"$f":"ComputeOutgoingCost(P10,F47,'Link-Group'!$B$7:$G$7, $P$4:$P$27, $D$4:$D$27,$G$4:$G$27,$J$4:$J$27,$M$4:$M$27,$S$4:$S$27)","v":0},{"$f":"ComputeOutgoingCost(S10,G47,'Link-Group'!$B$7:$G$7, $S$4:$S$27, $D$4:$D$27,$G$4:$G$27,$J$4:$J$27,$M$4:$M$27,$P$4:$P$27)","v":0},null,7,{"$f":"ComputeIncomingCost(D10, B47,'Link-Group'!$B$11, 'Link-Group'!B$7, $B$41:$G$64, $D$4:$D$27, $G$4:$G$27,$J$4:$J$27,$M$4:$M$27,$P$4:$P$27,$S$4:$S$27)","v":0},{"$f":"ComputeIncomingCost(G10, C47,'Link-Group'!$B$11, 'Link-Group'!C$7, $B$41:$G$64, $G$4:$G$27, $D$4:$D$27,$J$4:$J$27,$M$4:$M$27,$P$4:$P$27,$S$4:$S$27)","v":0},{"$f":"ComputeIncomingCost(J10, D47,'Link-Group'!$B$11, 'Link-Group'!D$7, $B$41:$G$64, $J$4:$J$27, $D$4:$D$27,$G$4:$G$27,$M$4:$M$27,$P$4:$P$27,$S$4:$S$27)","v":0},{"$f":"ComputeIncomingCost(M10, E47,'Link-Group'!$B$11, 'Link-Group'!E$7, $B$41:$G$64, $M$4:$M$27, $D$4:$D$27,$G$4:$G$27,$J$4:$J$27,$P$4:$P$27,$S$4:$S$27)","v":0},{"$f":"ComputeIncomingCost(P10, F47,'Link-Group'!$B$11, 'Link-Group'!F$7, $B$41:$G$64, $P$4:$P$27, $D$4:$D$27,$G$4:$G$27,$J$4:$J$27,$M$4:$M$27,$S$4:$S$27)","v":0},{"$f":"ComputeIncomingCost(S10, G47,'Link-Group'!$B$11, 'Link-Group'!G$7, $B$41:$G$64, $S$4:$S$27, $D$4:$D$27,$G$4:$G$27,$J$4:$J$27,$M$4:$M$27,$P$4:$P$27)","v":0},null,7,{"$f":"ComputeInternalCost(D10, B47, 'Link-Group'!$B$11, $B$41:$G$64, $D$4:$D$27, $G$4:$G$27,$J$4:$J$27,$M$4:$M$27,$P$4:$P$27,$S$4:$S$27)","v":0},{"$f":"ComputeInternalCost(G10, C47, 'Link-Group'!$B$11, $B$41:$G$64, $G$4:$G$27, $D$4:$D$27,$J$4:$J$27,$M$4:$M$27,$P$4:$P$27,$S$4:$S$27)","v":0},{"$f":"ComputeInternalCost(J10, D47, 'Link-Group'!$B$11, $B$41:$G$64, $J$4:$J$27, $D$4:$D$27,$G$4:$G$27,$M$4:$M$27,$P$4:$P$27,$S$4:$S$27)","v":0},{"$f":"ComputeInternalCost(M10, E47, 'Link-Group'!$B$11, $B$41:$G$64, $M$4:$M$27, $D$4:$D$27,$G$4:$G$27,$J$4:$J$27,$P$4:$P$27,$S$4:$S$27)","v":0},{"$f":"ComputeInternalCost(P10, F47, 'Link-Group'!$B$11, $B$41:$G$64, $P$4:$P$27, $D$4:$D$27,$G$4:$G$27,$J$4:$J$27,$M$4:$M$27,$S$4:$S$27)","v":0},{"$f":"ComputeInternalCost(S10, G47, 'Link-Group'!$B$11, $B$41:$G$64, $S$4:$S$27, $D$4:$D$27,$G$4:$G$27,$J$4:$J$27,$M$4:$M$27,$P$4:$P$27)","v":0}]
[8,{"$f":"IF(AND(B11<>\"\", D11<>\"\"),VLOOKUP(C11,Weights!$G$2:$H$6,2, 0),0)","v":0},{"$f":"IF(AND(E11<>\"\", G11<>\"\"),VLOOKUP(F11,Weights!$G$2:$H$6,2, 0),0)","v":0},{"$f":"IF(AND(H11<>\"\", J11<>\"\"),VLOOKUP(I11,Weights!$G$2:$H$6,2, 0),0)","v":0},{"$f":"IF(AND(K11<>\"\", M11<>\"\"),VLOOKUP(L11,Weights!$G$2:$H$6,2, 0),0)","v":0},{"$f":"IF(AND(N11<>\"\", P11<>\"\"),VLOOKUP(O11,Weights!$G$2:$H$6,2, 0),0)","v":0},{"$f":"IF(AND(Q11<>\"\", S11<>\"\"),VLOOKUP(R11,Weights!$G$2:$H$6,2, 0),0)","v":0},null,8,{"$f":"ComputeOutgoingCost(D11,B48,'Link-Group'!$B$7:$G$7,$D$4:$D$27, $G$4:$G$27,$J$4:$J$27,$M$4:$M$27,$P$4:$P$27,$S$4:$S$27)","v":0},{"$f":"ComputeOutgoingCost(G11,C48,'Link-Group'!$B$7:$G$7,$G$4:$G$27, $D$4:$D$27,$J$4:$J$27,$M$4:$M$27,$P$4:$P$27,$S$4:$S$27)","v":0},{"$f":"ComputeOutgoingCost(J11,D48,'Link-Group'!$B$7:$G$7, $J$4:$J$27, $D$4:$D$27,$G$4:$G$27,$M$4:$M$27,$P$4:$P$27,$S$4:$S$27)","v":0},{"$f":"ComputeOutgoingCost(M11,E48,'Link-Group'!$B$7:$G$7,$M$4:$M$27, $D$4:$D$27,$G$4:$G$27,$J$4:$J$27,$P$4:$P$27,$S$4:$S$27)","v":0},{"$f":"ComputeOutgoingCost(P11,F48,'Link-Group'!$B$7:$G$7, $P$4:$P$27, $D$4:$D$27,$G$4:$G$27,$J$4:$J$27,$M$4:$M$27,$S$4:$S$27)","v":0},{"$f":"ComputeOutgoingCost(S11,G48,'Link-Group'!$B$7:$G$7, $S$4:$S$27, $D$4:$D$27,$G$4:$G$27,$J$4:$J$27,$M$4:$M$27,$P$4:$P$27)","v":0},null,8,{"$f":"ComputeIncomingCost(D11, B48,'Link-Group'!$B$11, 'Link-Group'!B$7, $B$41:$G$64, $D$4:$D$27, $G$4:$G$27,$J$4:$J$27,$M$4:$M$27,$P$4:$P$27,$S$4:$S$27)","v":0},{"$f":"ComputeIncomingCost(G11, C48,'Link-Group'!$B$11, 'Link-Group'!C$7, $B$41:$G$64, $G$4:$G$27, $D$4:$D$27,$J$4:$J$27,$M$4:$M$27,$P$4:$P$27,$S$4:$S$27)","v":0},{"$f":"ComputeIncomingCost(J11, D48,'Link-Group'!$B$11, 'Link-Group'!D$7, $B$41:$G$64, $J$4:$J$27, $D$4:$D$27,$G$4:$G$27,$M$4:$M$27,$P$4:$P$27,$S$4:$S$27)","v":0},{"$f":"ComputeIncomingCost(M11, E48,'Link-Group'!$B$11, 'Link-Group'!E$7, $B$41:$G$64, $M$4:$M$27, $D$4:$D$27,$G$4:$G$27,$J$4:$J$27,$P$4:$P$27,$S$4:$S$27)","v":0},{"$f":"ComputeIncomingCost(P11, F48,'Link-Group'!$B$11, 'Link-Group'!F$7, $B$41:$G$64, $P$4:$P$27, $D$4:$D$27,$G$4:$G$27,$J$4:$J$27,$M$4:$M$27,$S$4:$S$27)","v":0},{"$f":"ComputeIncomingCost(S11, G48,'Link-Group'!$B$11, 'Link-Group'!G$7, $B$41:$G$64, $S$4:$S$27, $D$4:$D$27,$G$4:$G$27,$J$4:$J$27,$M$4:$M$27,$P$4:$P$27)","v":0},null,8,{"$f":"ComputeInternalCost(D11, B48, 'Link-Group'!$B$11, $B$41:$G$64, $D$4:$D$27, $G$4:$G$27,$J$4:$J$27,$M$4:$M$27,$P$4:$P$27,$S$4:$S$27)","v":0},{"$f":"ComputeInternalCost(G11, C48, 'Link-Group'!$B$11, $B$41:$G$64, $G$4:$G$27, $D$4:$D$27,$J$4:$J$27,$M$4:$M$27,$P$4:$P$27,$S$4:$S$27)","v":0},{"$f":"ComputeInternalCost(J11, D48, 'Link-Group'!$B$11, $B$41:$G$64, $J$4:$J$27, $D$4:$D$27,$G$4:$G$27,$M$4:$M$27,$P$4:$P$27,$S$4:$S$27)","v":0},{"$f":"ComputeInternalCost(M11, E48, 'Link-Group'!$B$11, $B$41:$G$64, $M$4:$M$27, $D$4:$D$27,$G$4:$G$27,$J$4:$J$27,$P$4:$P$27,$S$4:$S$27)","v":0},{"$f":"ComputeInternalCost(P11, F48, 'Link-Group'!$B$11, $B$41:$G$64, $P$4:$P$27, $D$4:$D$27,$G$4:$G$27,$J$4:$J$27,$M$4:$M$27,$S$4:$S$27)","v":0},{"$f":"ComputeInternalCost(S11, G48, 'Link-Group'!$B$11, $B$41:$G$64, $S$4:$S$27, $D$4:$D$27,$G$4:$G$27,$J$4:$J$27,$M$4:$M$27,$P$4:$P$27)","v":0}]
[9,{"$f":"IF(AND(B12<>\"\", D12<>\"\"),VLOOKUP(C12,Weights!$G$2:$H$6,2, 0),0)","v":0},{"$f":"IF(AND(E12<>\"\", G12<>\"\"),VLOOKUP(F12,Weights!$G$2:$H$6,2, 0),0)","v":0},{"$f":"IF(AND(H12<>\"\", J12<>\"\"),VLOOKUP(I12,Weights!$G$2:$H$6,2, 0),0)","v":0},{"$f":"IF(AND(K12<>\"\", M12<>\"\"),VLOOKUP(L12,Weights!$G$2:$H$6,2, 0),0)","v":0},{"$f":"IF(AND(N12<>\"\", P12<>\"\"),VLOOKUP(O12,Weights!$G$2:$H$6,2, 0),0)","v":0},{"$f":"IF(AND(Q12<>\"\", S12<>\"\"),VLOOKUP(R12,Weights!$G$2:$H$6,2, 0),0)","v":0},null,9,{"$f":"ComputeOutgoingCost(D12,B49,'Link-Group'!$B$7:$G$7,$D$4:$D$27, $G$4:$G$27,$J$4:$J$27,$M$4:$M$27,$P$4:$P$27,$S$4:$S$27)","v":0},{"$f":"ComputeOutgoingCost(G12,C49,'Link-Group'!$B$7:$G$7,$G$4:$G$27, $D$4:$D$27,$J$4:$J$27,$M$4:$M$27,$P$4:$P$27,$S$4:$S$27)","v":0},{"$f":"ComputeOutgoingCost(J12,D49,'Link-Group'!$B$7:$G$7, $J$4:$J$27, $D$4:$D$27,$G$4:$G$27,$M$4:$M$27,$P$4:$P$27,$S$4:$S$27)","v":0},{"$f":"ComputeOutgoingCost(M12,E49,'Link-Group'!$B$7:$G$7,$M$4:$M$27, $D$4:$D$27,$G$4:$G$27,$J$4:$J$27,$P$4:$P$27,$S$4:$S$27)","v":0},{"$f":"ComputeOutgoingCost(P12,F49,'Link-Group'!$B$7:$G$7, $P$4:$P$27, $D$4:$D$27,$G$4:$G$27,$J$4:$J$27,$M$4:$M$27,$S$4:$S$27)","v":0},{"$f":"ComputeOutgoingCost(S12,G49,'Link-Group'!$B$7:$G$7, $S$4:$S$27, $D$4:$D$27,$G$4:$G$27,$J$4:$J$27,$M$4:$M$27,$P$4:$P$27)","v":0},null,9,{"$f":"ComputeIncomingCost(D12, B49,'Link-Group'!$B$11, 'Link-Group'!B$7, $B$41:$G$64, $D$4:$D$27, $G$4:$G$27,$J$4:$J$27,$M$4:$M$27,$P$4:$P$27,$S$4:$S$27)","v":0},{"$f":"ComputeIncomingCost(G12, C49,'Link-Group'!$B$11, 'Link-Group'!C$7, $B$41:$G$64, $G$4:$G$27, $D$4:$D$27,$J$4:$J$27,$M$4:$M$27,$P$4:$P$27,$S$4:$S$27)","v":0},{"$f":"ComputeIncomingCost(J12, D49,'Link-Group'!$B$11, 'Link-Group'!D$7, $B$41:$G$64, $J$4:$J$27, $D$4:$D$27,$G$4:$G$27,$M$4:$M$27,$P$4:$P$27,$S$4:$S$27)","v":0},{"$f":"ComputeIncomingCost(M12, E49,'Link-Group'!$B$11, 'Link-Group'!E$7, $B$41:$G$64, $M$4:$M$27, $D$4:$D$27,$G$4:$G$27,$J$4:$J$27,$P$4:$P$27,$S$4:$S$27)","v":0},{"$f":"ComputeIncomingCost(P12, F49,'Link-Group'!$B$11, 'Link-Group'!F$7, $B$41:$G$64, $P$4:$P$27, $D$4:$D$27,$G$4:$G$27,$J$4:$J$27,$M$4:$M$27,$S$4:$S$27)","v":0},{"$f":"ComputeIncomingCost(S12, G49,'Link-Group'!$B$11, 'Link-Group'!G$7, $B$41:$G$64, $S$4:$S$27, $D$4:$D$27,$G$4:$G$27,$J$4:$J$27,$M$4:$M$27,$P$4:$P$27)","v":0},null,9,{"$f":"ComputeInternalCost(D12, B49, 'Link-Group'!$B$11, $B$41:$G$64, $D$4:$D$27, $G$4:$G$27,$J$4:$J$27,$M$4:$M$27,$P$4:$P$27,$S$4:$S$27)","v":0},{"$f":"ComputeInternalCost(G12, C49, 'Link-Group'!$B$11, $B$41:$G$64, $G$4:$G$27, $D$4:$D$27,$J$4:$J$27,$M$4:$M$27,$P$4:$P$27,$S$4:$S$27)","v":0},{"$f":"ComputeInternalCost(J12, D49, 'Link-Group'!$B$11, $B$41:$G$64, $J$4:$J$27, $D$4:$D$27,$G$4:$G$27,$M$4:$M$27,$P$4:$P$27,$S$4:$S$27)","v":0},{"$f":"ComputeInternalCost(M12, E49, 'Link-Group'!$B$11, $B$41:$G$64, $M$4:$M$27, $D$4:$D$27,$G$4:$G$27,$J$4:$J$27,$P$4:$P$27,$S$4:$S$27)","v":0},{"$f":"ComputeInternalCost(P12, F49, 'Link-Group'!$B$11, $B$41:$G$64, $P$4:$P$27, $D$4:$D$27,$G$4:$G$27,$J$4:$J$27,$M$4:$M$27,$S$4:$S$27)","v":0},{"$f":"ComputeInternalCost(S12, G49, 'Link-Group'!$B$11, $B$41:$G$64, $S$4:$S$27, $D$4:$D$27,$G$4:$G$27,$J$4:$J$27,$M$4:$M$27,$P$4:$P$27)","v":0}]
[10,{"$f":"IF(AND(B13<>\"\", D13<>\"\"),VLOOKUP(C13,Weights!$G$2:$H$6,2, 0),0)","v":0},{"$f":"IF(AND(E13<>\"\", G13<>\"\"),VLOOKUP(F13,Weights!$G$2:$H$6,2, 0),0)","v":0},{"$f":"IF(AND(H13<>\"\", J13<>\"\"),VLOOKUP(I13,Weights!$G$2:$H$6,2, 0),0)","v":0},{"$f":"IF(AND(K13<>\"\", M13<>\"\"),VLOOKUP(L13,Weights!$G$2:$H$6,2, 0),0)","v":0},{"$f":"IF(AND(N13<>\"\", P13<>\"\"),VLOOKUP(O13,Weights!$G$2:$H$6,2, 0),0)","v":0},{"$f":"IF(AND(Q13<>\"\", S13<>\"\"),VLOOKUP(R13,Weights!$G$2:$H$6,2, 0),0)","v":0},null,10,{"$f":"ComputeOutgoingCost(D13,B50,'Link-Group'!$B$7:$G$7,$D$4:$D$27, $G$4:$G$27,$J$4:$J$27,$M$4:$M$27,$P$4:$P$27,$S$4:$S$27)","v":0},{"$f":"ComputeOutgoingCost(G13,C50,'Link-Group'!$B$7:$G$7,$G$4:$G$27, $D$4:$D$27,$J$4:$J$27,$M$4:$M$27,$P$4:$P$27,$S$4:$S$27)","v":0},{"$f":"ComputeOutgoingCost(J13,D50,'Link-Group'!$B$7:$G$7, $J$4:$J$27, $D$4:$D$27,$G$4:$G$27,$M$4:$M$27,$P$4:$P$27,$S$4:$S$27)","v":0},{"$f":"ComputeOutgoingCost(M13,E50,'Link-Group'!$B$7:$G$7,$M$4:$M$27, $D$4:$D$27,$G$4:$G$27,$J$4:$J$27,$P$4:$P$27,$S$4:$S$27)","v":0},{"$f":"ComputeOutgoingCost(P13,F50,'Link-Group'!$B$7:$G$7, $P$4:$P$27, $D$4:$D$27,$G$4:$G$27,$J$4:$J$27,$M$4:$M$27,$S$4:$S$27)","v":0},{"$f":"ComputeOutgoingCost(S13,G50,'Link-Group'!$B$7:$G$7, $S$4:$S$27, $D$4:$D$27,$G$4:$G$27,$J$4:$J$27,$M$4:$M$27,$P$4:$P$27)","v":0},null,10,{"$f":"ComputeIncomingCost(D13, B50,'Link-Group'!$B$11, 'Link-Group'!B$7, $B$41:$G$64, $D$4:$D$27, $G$4:$G$27,$J$4:$J$27,$M$4:$M$27,$P$4:$P$27,$S$4:$S$27)","v":0},{"$f":"ComputeIncomingCost(G13, C50,'Link-Group'!$B$11, 'Link-Group'!C$7, $B$41:$G$64, $G$4:$G$27, $D$4:$D$27,$J$4:$J$27,$M$4:$M$27,$P$4:$P$27,$S$4:$S$27)","v":0},{"$f":"ComputeIncomingCost(J13, D50,'Link-Group'!$B$11, 'Link-Group'!D$7, $B$41:$G$64, $J$4:$J$27, $D$4:$D$27,$G$4:$G$27,$M$4:$M$27,$P$4:$P$27,$S$4:$S$27)","v":0},{"$f":"ComputeIncomingCost(M13, E50,'Link-Group'!$B$11, 'Link-Group'!E$7, $B$41:$G$64, $M$4:$M$27, $D$4:$D$27,$G$4:$G$27,$J$4:$J$27,$P$4:$P$27,$S$4:$S$27)","v":0},{"$f":"ComputeIncomingCost(P13, F50,'Link-Group'!$B$11, 'Link-Group'!F$7, $B$41:$G$64, $P$4:$P$27, $D$4:$D$27,$G$4:$G$27,$J$4:$J$27,$M$4:$M$27,$S$4:$S$27)","v":0},{"$f":"ComputeIncomingCost(S13, G50,'Link-Group'!$B$11, 'Link-Group'!G$7, $B$41:$G$64, $S$4:$S$27, $D$4:$D$27,$G$4:$G$27,$J$4:$J$27,$M$4:$M$27,$P$4:$P$27)","v":0},null,10,{"$f":"ComputeInternalCost(D13, B50, 'Link-Group'!$B$11, $B$41:$G$64, $D$4:$D$27, $G$4:$G$27,$J$4:$J$27,$M$4:$M$27,$P$4:$P$27,$S$4:$S$27)","v":0},{"$f":"ComputeInternalCost(G13, C50, 'Link-Group'!$B$11, $B$41:$G$64, $G$4:$G$27, $D$4:$D$27,$J$4:$J$27,$M$4:$M$27,$P$4:$P$27,$S$4:$S$27)","v":0},{"$f":"ComputeInternalCost(J13, D50, 'Link-Group'!$B$11, $B$41:$G$64, $J$4:$J$27, $D$4:$D$27,$G$4:$G$27,$M$4:$M$27,$P$4:$P$27,$S$4:$S$27)","v":0},{"$f":"ComputeInternalCost(M13, E50, 'Link-Group'!$B$11, $B$41:$G$64, $M$4:$M$27, $D$4:$D$27,$G$4:$G$27,$J$4:$J$27,$P$4:$P$27,$S$4:$S$27)","v":0},{"$f":"ComputeInternalCost(P13, F50, 'Link-Group'!$B$11, $B$41:$G$64, $P$4:$P$27, $D$4:$D$27,$G$4:$G$27,$J$4:$J$27,$M$4:$M$27,$S$4:$S$27)","v":0},{"$f":"ComputeInternalCost(S13, G50, 'Link-Group'!$B$11, $B$41:$G$64, $S$4:$S$27, $D$4:$D$27,$G$4:$G$27,$J$4:$J$27,$M$4:$M$27,$P$4:$P$27)","v":0}]
[11,{"$f":"IF(AND(B14<>\"\", D14<>\"\"),VLOOKUP(C14,Weights!$G$2:$H$6,2, 0),0)","v":0},{"$f":"IF(AND(E14<>\"\", G14<>\"\"),VLOOKUP(F14,Weights!$G$2:$H$6,2, 0),0)","v":0},{"$f":"IF(AND(H14<>\"\", J14<>\"\"),VLOOKUP(I14,Weights!$G$2:$H$6,2, 0),0)","v":0},{"$f":"IF(AND(K14<>\"\", M14<>\"\"),VLOOKUP(L14,Weights!$G$2:$H$6,2, 0),0)","v":0},{"$f":"IF(AND(N14<>\"\", P14<>\"\"),VLOOKUP(O14,Weights!$G$2:$H$6,2, 0),0)","v":0},{"$f":"IF(AND(Q14<>\"\", S14<>\"\"),VLOOKUP(R14,Weights!$G$2:$H$6,2, 0),0)","v":0},null,11,{"$f":"ComputeOutgoingCost(D14,B51,'Link-Group'!$B$7:$G$7,$D$4:$D$27, $G$4:$G$27,$J$4:$J$27,$M$4:$M$27,$P$4:$P$27,$S$4:$S$27)","v":0},{"$f":"ComputeOutgoingCost(G14,C51,'Link-Group'!$B$7:$G$7,$G$4:$G$27, $D$4:$D$27,$J$4:$J$27,$M$4:$M$27,$P$4:$P$27,$S$4:$S$27)","v":0},{"$f":"ComputeOutgoingCost(J14,D51,'Link-Group'!$B$7:$G$7, $J$4:$J$27, $D$4:$D$27,$G$4:$G$27,$M$4:$M$27,$P$4:$P$27,$S$4:$S$27)","v":0},{"$f":"ComputeOutgoingCost(M14,E51,'Link-Group'!$B$7:$G$7,$M$4:$M$27, $D$4:$D$27,$G$4:$G$27,$J$4:$J$27,$P$4:$P$27,$S$4:$S$27)","v":0},{"$f":"ComputeOutgoingCost(P14,F51,'Link-Group'!$B$7:$G$7, $P$4:$P$27, $D$4:$D$27,$G$4:$G$27,$J$4:$J$27,$M$4:$M$27,$S$4:$S$27)","v":0},{"$f":"ComputeOutgoingCost(S14,G51,'Link-Group'!$B$7:$G$7, $S$4:$S$27, $D$4:$D$27,$G$4:$G$27,$J$4:$J$27,$M$4:$M$27,$P$4:$P$27)","v":0},null,11,{"$f":"ComputeIncomingCost(D14, B51,'Link-Group'!$B$11, 'Link-Group'!B$7, $B$41:$G$64, $D$4:$D$27, $G$4:$G$27,$J$4:$J$27,$M$4:$M$27,$P$4:$P$27,$S$4:$S$27)","v":0},{"$f":"ComputeIncomingCost(G14, C51,'Link-Group'!$B$11, 'Link-Group'!C$7, $B$41:$G$64, $G$4:$G$27, $D$4:$D$27,$J$4:$J$27,$M$4:$M$27,$P$4:$P$27,$S$4:$S$27)","v":0},{"$f":"ComputeIncomingCost(J14, D51,'Link-Group'!$B$11, 'Link-Group'!D$7, $B$41:$G$64, $J$4:$J$27, $D$4:$D$27,$G$4:$G$27,$M$4:$M$27,$P$4:$P$27,$S$4:$S$27)","v":0},{"$f":"ComputeIncomingCost(M14, E51,'Link-Group'!$B$11, 'Link-Group'!E$7, $B$41:$G$64, $M$4:$M$27, $D$4:$D$27,$G$4:$G$27,$J$4:$J$27,$P$4:$P$27,$S$4:$S$27)","v":0},{"$f":"ComputeIncomingCost(P14, F51,'Link-Group'!$B$11, 'Link-Group'!F$7, $B$41:$G$64, $P$4:$P$27, $D$4:$D$27,$G$4:$G$27,$J$4:$J$27,$M$4:$M$27,$S$4:$S$27)","v":0},{"$f":"ComputeIncomingCost(S14, G51,'Link-Group'!$B$11, 'Link-Group'!G$7, $B$41:$G$64, $S$4:$S$27, $D$4:$D$27,$G$4:$G$27,$J$4:$J$27,$M$4:$M$27,$P$4:$P$27)","v":0},null,11,{"$f":"ComputeInternalCost(D14, B51, 'Link-Group'!$B$11, $B$41:$G$64, $D$4:$D$27, $G$4:$G$27,$J$4:$J$27,$M$4:$M$27,$P$4:$P$27,$S$4:$S$27)","v":0},{"$f":"ComputeInternalCost(G14, C51, 'Link-Group'!$B$11, $B$41:$G$64, $G$4:$G$27, $D$4:$D$27,$J$4:$J$27,$M$4:$M$27,$P$4:$P$27,$S$4:$S$27)","v":0},{"$f":"ComputeInternalCost(J14, D51, 'Link-Group'!$B$11, $B$41:$G$64, $J$4:$J$27, $D$4:$D$27,$G$4:$G$27,$M$4:$M$27,$P$4:$P$27,$S$4:$S$27)","v":0},{"$f":"ComputeInternalCost(M14, E51, 'Link-Group'!$B$11, $B$41:$G$64, $M$4:$M$27, $D$4:$D$27,$G$4:$G$27,$J$4:$J$27,$P$4:$P$27,$S$4:$S$27)","v":0},{"$f":"ComputeInternalCost(P14, F51, 'Link-Group'!$B$11, $B$41:$G$64, $P$4:$P$27, $D$4:$D$27,$G$4:$G$27,$J$4:$J$27,$M$4:$M$27,$S$4:$S$27)","v":0},{"$f":"ComputeInternalCost(S14, G51, 'Link-Group'!$B$11, $B$41:$G$64, $S$4:$S$27, $D$4:$D$27,$G$4:$G$27,$J$4:$J$27,$M$4:$M$27,$P$4:$P$27)","v":0}]
[12,{"$f":"IF(AND(B15<>\"\", D15<>\"\"),VLOOKUP(C15,Weights!$G$2:$H$6,2, 0),0)","v":0},{"$f":"IF(AND(E15<>\"\", G15<>\"\"),VLOOKUP(F15,Weights!$G$2:$H$6,2, 0),0)","v":0},{"$f":"IF(AND(H15<>\"\", J15<>\"\"),VLOOKUP(I15,Weights!$G$2:$H$6,2, 0),0)","v":0},{"$f":"IF(AND(K15<>\"\", M15<>\"\"),VLOOKUP(L15,Weights!$G$2:$H$6,2, 0),0)","v":0},{"$f":"IF(AND(N15<>\"\", P15<>\"\"),VLOOKUP(O15,Weights!$G$2:$H$6,2, 0),0)","v":0},{"$f":"IF(AND(Q15<>\"\", S15<>\"\"),VLOOKUP(R15,Weights!$G$2:$H$6,2, 0),0)","v":0},null,12,{"$f":"ComputeOutgoingCost(D15,B52,'Link-Group'!$B$7:$G$7,$D$4:$D$27, $G$4:$G$27,$J$4:$J$27,$M$4:$M$27,$P$4:$P$27,$S$4:$S$27)","v":0},{"$f":"ComputeOutgoingCost(G15,C52,'Link-Group'!$B$7:$G$7,$G$4:$G$27, $D$4:$D$27,$J$4:$J$27,$M$4:$M$27,$P$4:$P$27,$S$4:$S$27)","v":0},{"$f":"ComputeOutgoingCost(J15,D52,'Link-Group'!$B$7:$G$7, $J$4:$J$27, $D$4:$D$27,$G$4:$G$27,$M$4:$M$27,$P$4:$P$27,$S$4:$S$27)","v":0},{"$f":"ComputeOutgoingCost(M15,E52,'Link-Group'!$B$7:$G$7,$M$4:$M$27, $D$4:$D$27,$G$4:$G$27,$J$4:$J$27,$P$4:$P$27,$S$4:$S$27)","v":0},{"$f":"ComputeOutgoingCost(P15,F52,'Link-Group'!$B$7:$G$7, $P$4:$P$27, $D$4:$D$27,$G$4:$G$27,$J$4:$J$27,$M$4:$M$27,$S$4:$S$27)","v":0},{"$f":"ComputeOutgoingCost(S15,G52,'Link-Group'!$B$7:$G$7, $S$4:$S$27, $D$4:$D$27,$G$4:$G$27,$J$4:$J$27,$M$4:$M$27,$P$4:$P$27)","v":0},null,12,{"$f":"ComputeIncomingCost(D15, B52,'Link-Group'!$B$11, 'Link-Group'!B$7, $B$41:$G$64, $D$4:$D$27, $G$4:$G$27,$J$4:$J$27,$M$4:$M$27,$P$4:$P$27,$S$4:$S$27)","v":0},{"$f":"ComputeIncomingCost(G15, C52,'Link-Group'!$B$11, 'Link-Group'!C$7, $B$41:$G$64, $G$4:$G$27, $D$4:$D$27,$J$4:$J$27,$M$4:$M$27,$P$4:$P$27,$S$4:$S$27)","v":0},{"$f":"ComputeIncomingCost(J15, D52,'Link-Group'!$B$11, 'Link-Group'!D$7, $B$41:$G$64, $J$4:$J$27, $D$4:$D$27,$G$4:$G$27,$M$4:$M$27,$P$4:$P$27,$S$4:$S$27)","v":0},{"$f":"ComputeIncomingCost(M15, E52,'Link-Group'!$B$11, 'Link-Group'!E$7, $B$41:$G$64, $M$4:$M$27, $D$4:$D$27,$G$4:$G$27,$J$4:$J$27,$P$4:$P$27,$S$4:$S$27)","v":0},{"$f":"ComputeIncomingCost(P15, F52,'Link-Group'!$B$11, 'Link-Group'!F$7, $B$41:$G$64, $P$4:$P$27, $D$4:$D$27,$G$4:$G$27,$J$4:$J$27,$M$4:$M$27,$S$4:$S$27)","v":0},{"$f":"ComputeIncomingCost(S15, G52,'Link-Group'!$B$11, 'Link-Group'!G$7, $B$41:$G$64, $S$4:$S$27, $D$4:$D$27,$G$4:$G$27,$J$4:$J$27,$M$4:$M$27,$P$4:$P$27)","v":0},null,12,{"$f":"ComputeInternalCost(D15, B52, 'Link-Group'!$B$11, $B$41:$G$64, $D$4:$D$27, $G$4:$G$27,$J$4:$J$27,$M$4:$M$27,$P$4:$P$27,$S$4:$S$27)","v":0},{"$f":"ComputeInternalCost(G15, C52, 'Link-Group'!$B$11, $B$41:$G$64, $G$4:$G$27, $D$4:$D$27,$J$4:$J$27,$M$4:$M$27,$P$4:$P$27,$S$4:$S$27)","v":0},{"$f":"ComputeInternalCost(J15, D52, 'Link-Group'!$B$11, $B$41:$G$64, $J$4:$J$27, $D$4:$D$27,$G$4:$G$27,$M$4:$M$27,$P$4:$P$27,$S$4:$S$27)","v":0},{"$f":"ComputeInternalCost(M15, E52, 'Link-Group'!$B$11, $B$41:$G$64, $M$4:$M$27, $D$4:$D$27,$G$4:$G$27,$J$4:$J$27,$P$4:$P$27,$S$4:$S$27)","v":0},{"$f":"ComputeInternalCost(P15, F52, 'Link-Group'!$B$11, $B$41:$G$64, $P$4:$P$27, $D$4:$D$27,$G$4:$G$27,$J$4:$J$27,$M$4:$M$27,$S$4:$S$27)","v":0},{"$f":"ComputeInternalCost(S15, G52, 'Link-Group'!$B$11, $B$41:$G$64, $S$4:$S$27, $D$4:$D$27,$G$4:$G$27,$J$4:$J$27,$M$4:$M$27,$P$4:$P$27)","v":0}]
[13,{"$f":"IF(AND(B16<>\"\", D16<>\"\"),VLOOKUP(C16,Weights!$G$2:$H$6,2, 0),0)","v":0},{"$f":"IF(AND(E16<>\"\", G16<>\"\"),VLOOKUP(F16,Weights!$G$2:$H$6,2, 0),0)","v":0},{"$f":"IF(AND(H16<>\"\", J16<>\"\"),VLOOKUP(I16,Weights!$G$2:$H$6,2, 0),0)","v":0},{"$f":"IF(AND(K16<>\"\", M16<>\"\"),VLOOKUP(L16,Weights!$G$2:$H$6,2, 0),0)","v":0},{"$f":"IF(AND(N16<>\"\", P16<>\"\"),VLOOKUP(O16,Weights!$G$2:$H$6,2, 0),0)","v":0},{"$f":"IF(AND(Q16<>\"\", S16<>\"\"),VLOOKUP(R16,Weights!$G$2:$H$6,2, 0),0)","v":0},null,13,{"$f":"ComputeOutgoingCost(D16,B53,'Link-Group'!$B$7:$G$7,$D$4:$D$27, $G$4:$G$27,$J$4:$J$27,$M$4:$M$27,$P$4:$P$27,$S$4:$S$27)","v":0},{"$f":"ComputeOutgoingCost(G16,C53,'Link-Group'!$B$7:$G$7,$G$4:$G$27, $D$4:$D$27,$J$4:$J$27,$M$4:$M$27,$P$4:$P$27,$S$4:$S$27)","v":0},{"$f":"ComputeOutgoingCost(J16,D53,'Link-Group'!$B$7:$G$7, $J$4:$J$27, $D$4:$D$27,$G$4:$G$27,$M$4:$M$27,$P$4:$P$27,$S$4:$S$27)","v":0},{"$f":"ComputeOutgoingCost(M16,E53,'Link-Group'!$B$7:$G$7,$M$4:$M$27, $D$4:$D$27,$G$4:$G$27,$J$4:$J$27,$P$4:$P$27,$S$4:$S$27)","v":0},{"$f":"ComputeOutgoingCost(P16,F53,'Link-Group'!$B$7:$G$7, $P$4:$P$27, $D$4:$D$27,$G$4:$G$27,$J$4:$J$27,$M$4:$M$27,$S$4:$S$27)","v":0},{"$f":"ComputeOutgoingCost(S16,G53,'Link-Group'!$B$7:$G$7, $S$4:$S$27, $D$4:$D$27,$G$4:$G$27,$J$4:$J$27,$M$4:$M$27,$P$4:$P$27)","v":0},null,13,{"$f":"ComputeIncomingCost(D16, B53,'Link-Group'!$B$11, 'Link-Group'!B$7, $B$41:$G$64, $D$4:$D$27, $G$4:$G$27,$J$4:$J$27,$M$4:$M$27,$P$4:$P$27,$S$4:$S$27)","v":0},{"$f":"ComputeIncomingCost(G16, C53,'Link-Group'!$B$11, 'Link-Group'!C$7, $B$41:$G$64, $G$4:$G$27, $D$4:$D$27,$J$4:$J$27,$M$4:$M$27,$P$4:$P$27,$S$4:$S$27)","v":0},{"$f":"ComputeIncomingCost(J16, D53,'Link-Group'!$B$11, 'Link-Group'!D$7, $B$41:$G$64, $J$4:$J$27, $D$4:$D$27,$G$4:$G$27,$M$4:$M$27,$P$4:$P$27,$S$4:$S$27)","v":0},{"$f":"ComputeIncomingCost(M16, E53,'Link-Group'!$B$11, 'Link-Group'!E$7, $B$41:$G$64, $M$4:$M$27, $D$4:$D$27,$G$4:$G$27,$J$4:$J$27,$P$4:$P$27,$S$4:$S$27)","v":0},{"$f":"ComputeIncomingCost(P16, F53,'Link-Group'!$B$11, 'Link-Group'!F$7, $B$41:$G$64, $P$4:$P$27, $D$4:$D$27,$G$4:$G$27,$J$4:$J$27,$M$4:$M$27,$S$4:$S$27)","v":0},{"$f":"ComputeIncomingCost(S16, G53,'Link-Group'!$B$11, 'Link-Group'!G$7, $B$41:$G$64, $S$4:$S$27, $D$4:$D$27,$G$4:$G$27,$J$4:$J$27,$M$4:$M$27,$P$4:$P$27)","v":0},null,13,{"$f":"ComputeInternalCost(D16, B53, 'Link-Group'!$B$11, $B$41:$G$64, $D$4:$D$27, $G$4:$G$27,$J$4:$J$27,$M$4:$M$27,$P$4:$P$27,$S$4:$S$27)","v":0},{"$f":"ComputeInternalCost(G16, C53, 'Link-Group'!$B$11, $B$41:$G$64, $G$4:$G$27, $D$4:$D$27,$J$4:$J$27,$M$4:$M$27,$P$4:$P$27,$S$4:$S$27)","v":0},{"$f":"ComputeInternalCost(J16, D53, 'Link-Group'!$B$11, $B$41:$G$64, $J$4:$J$27, $D$4:$D$27,$G$4:$G$27,$M$4:$M$27,$P$4:$P$27,$S$4:$S$27)","v":0},{"$f":"ComputeInternalCost(M16, E53, 'Link-Group'!$B$11, $B$41:$G$64, $M$4:$M$27, $D$4:$D$27,$G$4:$G$27,$J$4:$J$27,$P$4:$P$27,$S$4:$S$27)","v":0},{"$f":"ComputeInternalCost(P16, F53, 'Link-Group'!$B$11, $B$41:$G$64, $P$4:$P$27, $D$4:$D$27,$G$4:$G$27,$J$4:$J$27,$M$4:$M$27,$S$4:$S$27)","v":0},{"$f":"ComputeInternalCost(S16, G53, 'Link-Group'!$B$11, $B$41:$G$64, $S$4:$S$27, $D$4:$D$27,$G$4:$G$27,$J$4:$J$27,$M$4:$M$27,$P$4:$P$27)","v":0}]
[14,{"$f":"IF(AND(B17<>\"\", D17<>\"\"),VLOOKUP(C17,Weights!$G$2:$H$6,2, 0),0)","v":0},{"$f":"IF(AND(E17<>\"\", G17<>\"\"),VLOOKUP(F17,Weights!$G$2:$H$6,2, 0),0)","v":0},{"$f":"IF(AND(H17<>\"\", J17<>\"\"),VLOOKUP(I17,Weights!$G$2:$H$6,2, 0),0)","v":0},{"$f":"IF(AND(K17<>\"\", M17<>\"\"),VLOOKUP(L17,Weights!$G$2:$H$6,2, 0),0)","v":0},{"$f":"IF(AND(N17<>\"\", P17<>\"\"),VLOOKUP(O17,Weights!$G$2:$H$6,2, 0),0)","v":0},{"$f":"IF(AND(Q17<>\"\", S17<>\"\"),VLOOKUP(R17,Weights!$G$2:$H$6,2, 0),0)","v":0},null,14,{"$f":"ComputeOutgoingCost(D17,B54,'Link-Group'!$B$7:$G$7,$D$4:$D$27, $G$4:$G$27,$J$4:$J$27,$M$4:$M$27,$P$4:$P$27,$S$4:$S$27)","v":0},{"$f":"ComputeOutgoingCost(G17,C54,'Link-Group'!$B$7:$G$7,$G$4:$G$27, $D$4:$D$27,$J$4:$J$27,$M$4:$M$27,$P$4:$P$27,$S$4:$S$27)","v":0},{"$f":"ComputeOutgoingCost(J17,D54,'Link-Group'!$B$7:$G$7, $J$4:$J$27, $D$4:$D$27,$G$4:$G$27,$M$4:$M$27,$P$4:$P$27,$S$4:$S$27)","v":0},{"$f":"ComputeOutgoingCost(M17,E54,'Link-Group'!$B$7:$G$7,$M$4:$M$27, $D$4:$D$27,$G$4:$G$27,$J$4:$J$27,$P$4:$P$27,$S$4:$S$27)","v":0},{"$f":"ComputeOutgoingCost(P17,F54,'Link-Group'!$B$7:$G$7, $P$4:$P$27, $D$4:$D$27,$G$4:$G$27,$J$4:$J$27,$M$4:$M$27,$S$4:$S$27)","v":0},{"$f":"ComputeOutgoingCost(S17,G54,'Link-Group'!$B$7:$G$7, $S$4:$S$27, $D$4:$D$27,$G$4:$G$27,$J$4:$J$27,$M$4:$M$27,$P$4:$P$27)","v":0},null,14,{"$f":"ComputeIncomingCost(D17, B54,'Link-Group'!$B$11, 'Link-Group'!B$7, $B$41:$G$64, $D$4:$D$27, $G$4:$G$27,$J$4:$J$27,$M$4:$M$27,$P$4:$P$27,$S$4:$S$27)","v":0},{"$f":"ComputeIncomingCost(G17, C54,'Link-Group'!$B$11, 'Link-Group'!C$7, $B$41:$G$64, $G$4:$G$27, $D$4:$D$27,$J$4:$J$27,$M$4:$M$27,$P$4:$P$27,$S$4:$S$27)","v":0},{"$f":"ComputeIncomingCost(J17, D54,'Link-Group'!$B$11, 'Link-Group'!D$7, $B$41:$G$64, $J$4:$J$27, $D$4:$D$27,$G$4:$G$27,$M$4:$M$27,$P$4:$P$27,$S$4:$S$27)","v":0},{"$f":"ComputeIncomingCost(M17, E54,'Link-Group'!$B$11, 'Link-Group'!E$7, $B$41:$G$64, $M$4:$M$27, $D$4:$D$27,$G$4:$G$27,$J$4:$J$27,$P$4:$P$27,$S$4:$S$27)","v":0},{"$f":"ComputeIncomingCost(P17, F54,'Link-Group'!$B$11, 'Link-Group'!F$7, $B$41:$G$64, $P$4:$P$27, $D$4:$D$27,$G$4:$G$27,$J$4:$J$27,$M$4:$M$27,$S$4:$S$27)","v":0},{"$f":"ComputeIncomingCost(S17, G54,'Link-Group'!$B$11, 'Link-Group'!G$7, $B$41:$G$64, $S$4:$S$27, $D$4:$D$27,$G$4:$G$27,$J$4:$J$27,$M$4:$M$27,$P$4:$P$27)","v":0},null,14,{"$f":"ComputeInternalCost(D17, B54, 'Link-Group'!$B$11, $B$41:$G$64, $D$4:$D$27, $G$4:$G$27,$J$4:$J$27,$M$4:$M$27,$P$4:$P$27,$S$4:$S$27)","v":0},{"$f":"ComputeInternalCost(G17, C54, 'Link-Group'!$B$11, $B$41:$G$64, $G$4:$G$27, $D$4:$D$27,$J$4:$J$27,$M$4:$M$27,$P$4:$P$27,$S$4:$S$27)","v":0},{"$f":"ComputeInternalCost(J17, D54, 'Link-Group'!$B$11, $B$41:$G$64, $J$4:$J$27, $D$4:$D$27,$G$4:$G$27,$M$4:$M$27,$P$4:$P$27,$S$4:$S$27)","v":0},{"$f":"ComputeInternalCost(M17, E54, 'Link-Group'!$B$11, $B$41:$G$64, $M$4:$M$27, $D$4:$D$27,$G$4:$G$27,$J$4:$J$27,$P$4:$P$27,$S$4:$S$27)","v":0},{"$f":"ComputeInternalCost(P17, F54, 'Link-Group'!$B$11, $B$41:$G$64, $P$4:$P$27, $D$4:$D$27,$G$4:$G$27,$J$4:$J$27,$M$4:$M$27,$S$4:$S$27)","v":0},{"$f":"ComputeInternalCost(S17, G54, 'Link-Group'!$B$11, $B$41:$G$64, $S$4:$S$27, $D$4:$D$27,$G$4:$G$27,$J$4:$J$27,$M$4:$M$27,$P$4:$P$27)","v":0}]
[15,{"$f":"IF(AND(B18<>\"\", D18<>\"\"),VLOOKUP(C18,Weights!$G$2:$H$6,2, 0),0)","v":0},{"$f":"IF(AND(E18<>\"\", G18<>\"\"),VLOOKUP(F18,Weights!$G$2:$H$6,2, 0),0)","v":0},{"$f":"IF(AND(H18<>\"\", J18<>\"\"),VLOOKUP(I18,Weights!$G$2:$H$6,2, 0),0)","v":0},{"$f":"IF(AND(K18<>\"\", M18<>\"\"),VLOOKUP(L18,Weights!$G$2:$H$6,2, 0),0)","v":0},{"$f":"IF(AND(N18<>\"\", P18<>\"\"),VLOOKUP(O18,Weights!$G$2:$H$6,2, 0),0)","v":0},{"$f":"IF(AND(Q18<>\"\", S18<>\"\"),VLOOKUP(R18,Weights!$G$2:$H$6,2, 0),0)","v":0},null,15,{"$f":"ComputeOutgoingCost(D18,B55,'Link-Group'!$B$7:$G$7,$D$4:$D$27, $G$4:$G$27,$J$4:$J$27,$M$4:$M$27,$P$4:$P$27,$S$4:$S$27)","v":0},{"$f":"ComputeOutgoingCost(G18,C55,'Link-Group'!$B$7:$G$7,$G$4:$G$27, $D$4:$D$27,$J$4:$J$27,$M$4:$M$27,$P$4:$P$27,$S$4:$S$27)","v":0},{"$f":"ComputeOutgoingCost(J18,D55,'Link-Group'!$B$7:$G$7, $J$4:$J$27, $D$4:$D$27,$G$4:$G$27,$M$4:$M$27,$P$4:$P$27,$S$4:$S$27)","v":0},{"$f":"ComputeOutgoingCost(M18,E55,'Link-Group'!$B$7:$G$7,$M$4:$M$27, $D$4:$D$27,$G$4:$G$27,$J$4:$J$27,$P$4:$P$27,$S$4:$S$27)","v":0},{"$f":"ComputeOutgoingCost(P18,F55,'Link-Group'!$B$7:$G$7, $P$4:$P$27, $D$4:$D$27,$G$4:$G$27,$J$4:$J$27,$M$4:$M$27,$S$4:$S$27)","v":0},{"$f":"ComputeOutgoingCost(S18,G55,'Link-Group'!$B$7:$G$7, $S$4:$S$27, $D$4:$D$27,$G$4:$G$27,$J$4:$J$27,$M$4:$M$27,$P$4:$P$27)","v":0},null,15,{"$f":"ComputeIncomingCost(D18, B55,'Link-Group'!$B$11, 'Link-Group'!B$7, $B$41:$G$64, $D$4:$D$27, $G$4:$G$27,$J$4:$J$27,$M$4:$M$27,$P$4:$P$27,$S$4:$S$27)","v":0},{"$f":"ComputeIncomingCost(G18, C55,'Link-Group'!$B$11, 'Link-Group'!C$7, $B$41:$G$64, $G$4:$G$27, $D$4:$D$27,$J$4:$J$27,$M$4:$M$27,$P$4:$P$27,$S$4:$S$27)","v":0},{"$f":"ComputeIncomingCost(J18, D55,'Link-Group'!$B$11, 'Link-Group'!D$7, $B$41:$G$64, $J$4:$J$27, $D$4:$D$27,$G$4:$G$27,$M$4:$M$27,$P$4:$P$27,$S$4:$S$27)","v":0},{"$f":"ComputeIncomingCost(M18, E55,'Link-Group'!$B$11, 'Link-Group'!E$7, $B$41:$G$64, $M$4:$M$27, $D$4:$D$27,$G$4:$G$27,$J$4:$J$27,$P$4:$P$27,$S$4:$S$27)","v":0},{"$f":"ComputeIncomingCost(P18, F55,'Link-Group'!$B$11, 'Link-Group'!F$7, $B$41:$G$64, $P$4:$P$27, $D$4:$D$27,$G$4:$G$27,$J$4:$J$27,$M$4:$M$27,$S$4:$S$27)","v":0},{"$f":"ComputeIncomingCost(S18, G55,'Link-Group'!$B$11, 'Link-Group'!G$7, $B$41:$G$64, $S$4:$S$27, $D$4:$D$27,$G$4:$G$27,$J$4:$J$27,$M$4:$M$27,$P$4:$P$27)","v":0},null,15,{"$f":"ComputeInternalCost(D18, B55, 'Link-Group'!$B$11, $B$41:$G$64, $D$4:$D$27, $G$4:$G$27,$J$4:$J$27,$M$4:$M$27,$P$4:$P$27,$S$4:$S$27)","v":0},{"$f":"ComputeInternalCost(G18, C55, 'Link-Group'!$B$11, $B$41:$G$64, $G$4:$G$27, $D$4:$D$27,$J$4:$J$27,$M$4:$M$27,$P$4:$P$27,$S$4:$S$27)","v":0},{"$f":"ComputeInternalCost(J18, D55, 'Link-Group'!$B$11, $B$41:$G$64, $J$4:$J$27, $D$4:$D$27,$G$4:$G$27,$M$4:$M$27,$P$4:$P$27,$S$4:$S$27)","v":0},{"$f":"ComputeInternalCost(M18, E55, 'Link-Group'!$B$11, $B$41:$G$64, $M$4:$M$27, $D$4:$D$27,$G$4:$G$27,$J$4:$J$27,$P$4:$P$27,$S$4:$S$27)","v":0},{"$f":"ComputeInternalCost(P18, F55, 'Link-Group'!$B$11, $B$41:$G$64, $P$4:$P$27, $D$4:$D$27,$G$4:$G$27,$J$4:$J$27,$M$4:$M$27,$S$4:$S$27)","v":0},{"$f":"ComputeInternalCost(S18, G55, 'Link-Group'!$B$11, $B$41:$G$64, $S$4:$S$27, $D$4:$D$27,$G$4:$G$27,$J$4:$J$27,$M$4:$M$27,$P$4:$P$27)","v":0}]
[16,{"$f":"IF(AND(B19<>\"\", D19<>\"\"),VLOOKUP(C19,Weights!$G$2:$H$6,2, 0),0)","v":0},{"$f":"IF(AND(E19<>\"\", G19<>\"\"),VLOOKUP(F19,Weights!$G$2:$H$6,2, 0),0)","v":0},{"$f":"IF(AND(H19<>\"\", J19<>\"\"),VLOOKUP(I19,Weights!$G$2:$H$6,2, 0),0)","v":0},{"$f":"IF(AND(K19<>\"\", M19<>\"\"),VLOOKUP(L19,Weights!$G$2:$H$6,2, 0),0)","v":0},{"$f":"IF(AND(N19<>\"\", P19<>\"\"),VLOOKUP(O19,Weights!$G$2:$H$6,2, 0),0)","v":0},{"$f":"IF(AND(Q19<>\"\", S19<>\"\"),VLOOKUP(R19,Weights!$G$2:$H$6,2, 0),0)","v":0},null,16,{"$f":"ComputeOutgoingCost(D19,B56,'Link-Group'!$B$7:$G$7,$D$4:$D$27, $G$4:$G$27,$J$4:$J$27,$M$4:$M$27,$P$4:$P$27,$S$4:$S$27)","v":0},{"$f":"ComputeOutgoingCost(G19,C56,'Link-Group'!$B$7:$G$7,$G$4:$G$27, $D$4:$D$27,$J$4:$J$27,$M$4:$M$27,$P$4:$P$27,$S$4:$S$27)","v":0},{"$f":"ComputeOutgoingCost(J19,D56,'Link-Group'!$B$7:$G$7, $J$4:$J$27, $D$4:$D$27,$G$4:$G$27,$M$4:$M$27,$P$4:$P$27,$S$4:$S$27)","v":0},{"$f":"ComputeOutgoingCost(M19,E56,'Link-Group'!$B$7:$G$7,$M$4:$M$27, $D$4:$D$27,$G$4:$G$27,$J$4:$J$27,$P$4:$P$27,$S$4:$S$27)","v":0},{"$f":"ComputeOutgoingCost(P19,F56,'Link-Group'!$B$7:$G$7, $P$4:$P$27, $D$4:$D$27,$G$4:$G$27,$J$4:$J$27,$M$4:$M$27,$S$4:$S$27)","v":0},{"$f":"ComputeOutgoingCost(S19,G56,'Link-Group'!$B$7:$G$7, $S$4:$S$27, $D$4:$D$27,$G$4:$G$27,$J$4:$J$27,$M$4:$M$27,$P$4:$P$27)","v":0},null,16,{"$f":"ComputeIncomingCost(D19, B56,'Link-Group'!$B$11, 'Link-Group'!B$7, $B$41:$G$64, $D$4:$D$27, $G$4:$G$27,$J$4:$J$27,$M$4:$M$27,$P$4:$P$27,$S$4:$S$27)","v":0},{"$f":"ComputeIncomingCost(G19, C56,'Link-Group'!$B$11, 'Link-Group'!C$7, $B$41:$G$64, $G$4:$G$27, $D$4:$D$27,$J$4:$J$27,$M$4:$M$27,$P$4:$P$27,$S$4:$S$27)","v":0},{"$f":"ComputeIncomingCost(J19, D56,'Link-Group'!$B$11, 'Link-Group'!D$7, $B$41:$G$64, $J$4:$J$27, $D$4:$D$27,$G$4:$G$27,$M$4:$M$27,$P$4:$P$27,$S$4:$S$27)","v":0},{"$f":"ComputeIncomingCost(M19, E56,'Link-Group'!$B$11, 'Link-Group'!E$7, $B$41:$G$64, $M$4:$M$27, $D$4:$D$27,$G$4:$G$27,$J$4:$J$27,$P$4:$P$27,$S$4:$S$27)","v":0},{"$f":"ComputeIncomingCost(P19, F56,'Link-Group'!$B$11, 'Link-Group'!F$7, $B$41:$G$64, $P$4:$P$27, $D$4:$D$27,$G$4:$G$27,$J$4:$J$27,$M$4:$M$27,$S$4:$S$27)","v":0},{"$f":"ComputeIncomingCost(S19, G56,'Link-Group'!$B$11, 'Link-Group'!G$7, $B$41:$G$64, $S$4:$S$27, $D$4:$D$27,$G$4:$G$27,$J$4:$J$27,$M$4:$M$27,$P$4:$P$27)","v":0},null,16,{"$f":"ComputeInternalCost(D19, B56, 'Link-Group'!$B$11, $B$41:$G$64, $D$4:$D$27, $G$4:$G$27,$J$4:$J$27,$M$4:$M$27,$P$4:$P$27,$S$4:$S$27)","v":0},{"$f":"ComputeInternalCost(G19, C56, 'Link-Group'!$B$11, $B$41:$G$64, $G$4:$G$27, $D$4:$D$27,$J$4:$J$27,$M$4:$M$27,$P$4:$P$27,$S$4:$S$27)","v":0},{"$f":"ComputeInternalCost(J19, D56, 'Link-Group'!$B$11, $B$41:$G$64, $J$4:$J$27, $D$4:$D$27,$G$4:$G$27,$M$4:$M$27,$P$4:$P$27,$S$4:$S$27)","v":0},{"$f":"ComputeInternalCost(M19, E56, 'Link-Group'!$B$11, $B$41:$G$64, $M$4:$M$27, $D$4:$D$27,$G$4:$G$27,$J$4:$J$27,$P$4:$P$27,$S$4:$S$27)","v":0},{"$f":"ComputeInternalCost(P19, F56, 'Link-Group'!$B$11, $B$41:$G$64, $P$4:$P$27, $D$4:$D$27,$G$4:$G$27,$J$4:$J$27,$M$4:$M$27,$S$4:$S$27)","v":0},{"$f":"ComputeInternalCost(S19, G56, 'Link-Group'!$B$11, $B$41:$G$64, $S$4:$S$27, $D$4:$D$27,$G$4:$G$27,$J$4:$J$27,$M$4:$M$27,$P$4:$P$27)","v":0}]
[17,{"$f":"IF(AND(B20<>\"\", D20<>\"\"),VLOOKUP(C20,Weights!$G$2:$H$6,2, 0),0)","v":0},{"$f":"IF(AND(E20<>\"\", G20<>\"\"),VLOOKUP(F20,Weights!$G$2:$H$6,2, 0),0)","v":0},{"$f":"IF(AND(H20<>\"\", J20<>\"\"),VLOOKUP(I20,Weights!$G$2:$H$6,2, 0),0)","v":0},{"$f":"IF(AND(K20<>\"\", M20<>\"\"),VLOOKUP(L20,Weights!$G$2:$H$6,2, 0),0)","v":0},{"$f":"IF(AND(N20<>\"\", P20<>\"\"),VLOOKUP(O20,Weights!$G$2:$H$6,2, 0),0)","v":0},{"$f":"IF(AND(Q20<>\"\", S20<>\"\"),VLOOKUP(R20,Weights!$G$2:$H$6,2, 0),0)","v":0},null,17,{"$f":"ComputeOutgoingCost(D20,B57,'Link-Group'!$B$7:$G$7,$D$4:$D$27, $G$4:$G$27,$J$4:$J$27,$M$4:$M$27,$P$4:$P$27,$S$4:$S$27)","v":0},{"$f":"ComputeOutgoingCost(G20,C57,'Link-Group'!$B$7:$G$7,$G$4:$G$27, $D$4:$D$27,$J$4:$J$27,$M$4:$M$27,$P$4:$P$27,$S$4:$S$27)","v":0},{"$f":"ComputeOutgoingCost(J20,D57,'Link-Group'!$B$7:$G$7, $J$4:$J$27, $D$4:$D$27,$G$4:$G$27,$M$4:$M$27,$P$4:$P$27,$S$4:$S$27)","v":0},{"$f":"ComputeOutgoingCost(M20,E57,'Link-Group'!$B$7:$G$7,$M$4:$M$27, $D$4:$D$27,$G$4:$G$27,$J$4:$J$27,$P$4:$P$27,$S$4:$S$27)","v":0},{"$f":"ComputeOutgoingCost(P20,F57,'Link-Group'!$B$7:$G$7, $P$4:$P$27, $D$4:$D$27,$G$4:$G$27,$J$4:$J$27,$M$4:$M$27,$S$4:$S$27)","v":0},{"$f":"ComputeOutgoingCost(S20,G57,'Link-Group'!$B$7:$G$7, $S$4:$S$27, $D$4:$D$27,$G$4:$G$27,$J$4:$J$27,$M$4:$M$27,$P$4:$P$27)","v":0},null,17,{"$f":"ComputeIncomingCost(D20, B57,'Link-Group'!$B$11, 'Link-Group'!B$7, $B$41:$G$64, $D$4:$D$27, $G$4:$G$27,$J$4:$J$27,$M$4:$M$27,$P$4:$P$27,$S$4:$S$27)","v":0},{"$f":"ComputeIncomingCost(G20, C57,'Link-Group'!$B$11, 'Link-Group'!C$7, $B$41:$G$64, $G$4:$G$27, $D$4:$D$27,$J$4:$J$27,$M$4:$M$27,$P$4:$P$27,$S$4:$S$27)","v":0},{"$f":"ComputeIncomingCost(J20, D57,'Link-Group'!$B$11, 'Link-Group'!D$7, $B$41:$G$64, $J$4:$J$27, $D$4:$D$27,$G$4:$G$27,$M$4:$M$27,$P$4:$P$27,$S$4:$S$27)","v":0},{"$f":"ComputeIncomingCost(M20, E57,'Link-Group'!$B$11, 'Link-Group'!E$7, $B$41:$G$64, $M$4:$M$27, $D$4:$D$27,$G$4:$G$27,$J$4:$J$27,$P$4:$P$27,$S$4:$S$27)","v":0},{"$f":"ComputeIncomingCost(P20, F57,'Link-Group'!$B$11, 'Link-Group'!F$7, $B$41:$G$64, $P$4:$P$27, $D$4:$D$27,$G$4:$G$27,$J$4:$J$27,$M$4:$M$27,$S$4:$S$27)","v":0},{"$f":"ComputeIncomingCost(S20, G57,'Link-Group'!$B$11, 'Link-Group'!G$7, $B$41:$G$64, $S$4:$S$27, $D$4:$D$27,$G$4:$G$27,$J$4:$J$27,$M$4:$M$27,$P$4:$P$27)","v":0},null,17,{"$f":"ComputeInternalCost(D20, B57, 'Link-Group'!$B$11, $B$41:$G$64, $D$4:$D$27, $G$4:$G$27,$J$4:$J$27,$M$4:$M$27,$P$4:$P$27,$S$4:$S$27)","v":0},{"$f":"ComputeInternalCost(G20, C57, 'Link-Group'!$B$11, $B$41:$G$64, $G$4:$G$27, $D$4:$D$27,$J$4:$J$27,$M$4:$M$27,$P$4:$P$27,$S$4:$S$27)","v":0},{"$f":"ComputeInternalCost(J20, D57, 'Link-Group'!$B$11, $B$41:$G$64, $J$4:$J$27, $D$4:$D$27,$G$4:$G$27,$M$4:$M$27,$P$4:$P$27,$S$4:$S$27)","v":0},{"$f":"ComputeInternalCost(M20, E57, 'Link-Group'!$B$11, $B$41:$G$64, $M$4:$M$27, $D$4:$D$27,$G$4:$G$27,$J$4:$J$27,$P$4:$P$27,$S$4:$S$27)","v":0},{"$f":"ComputeInternalCost(P20, F57, 'Link-Group'!$B$11, $B$41:$G$64, $P$4:$P$27, $D$4:$D$27,$G$4:$G$27,$J$4:$J$27,$M$4:$M$27,$S$4:$S$27)","v":0},{"$f":"ComputeInternalCost(S20, G57, 'Link-Group'!$B$11, $B$41:$G$64, $S$4:$S$27, $D$4:$D$27,$G$4:$G$27,$J$4:$J$27,$M$4:$M$27,$P$4:$P$27)","v":0}]
[18,{"$f":"IF(AND(B21<>\"\", D21<>\"\"),VLOOKUP(C21,Weights!$G$2:$H$6,2, 0),0)","v":0},{"$f":"IF(AND(E21<>\"\", G21<>\"\"),VLOOKUP(F21,Weights!$G$2:$H$6,2, 0),0)","v":0},{"$f":"IF(AND(H21<>\"\", J21<>\"\"),VLOOKUP(I21,Weights!$G$2:$H$6,2, 0),0)","v":0},{"$f":"IF(AND(K21<>\"\", M21<>\"\"),VLOOKUP(L21,Weights!$G$2:$H$6,2, 0),0)","v":0},{"$f":"IF(AND(N21<>\"\", P21<>\"\"),VLOOKUP(O21,Weights!$G$2:$H$6,2, 0),0)","v":0},{"$f":"IF(AND(Q21<>\"\", S21<>\"\"),VLOOKUP(R21,Weights!$G$2:$H$6,2, 0),0)","v":0},null,18,{"$f":"ComputeOutgoingCost(D21,B58,'Link-Group'!$B$7:$G$7,$D$4:$D$27, $G$4:$G$27,$J$4:$J$27,$M$4:$M$27,$P$4:$P$27,$S$4:$S$27)","v":0},{"$f":"ComputeOutgoingCost(G21,C58,'Link-Group'!$B$7:$G$7,$G$4:$G$27, $D$4:$D$27,$J$4:$J$27,$M$4:$M$27,$P$4:$P$27,$S$4:$S$27)","v":0},{"$f":"ComputeOutgoingCost(J21,D58,'Link-Group'!$B$7:$G$7, $J$4:$J$27, $D$4:$D$27,$G$4:$G$27,$M$4:$M$27,$P$4:$P$27,$S$4:$S$27)","v":0},{"$f":"ComputeOutgoingCost(M21,E58,'Link-Group'!$B$7:$G$7,$M$4:$M$27, $D$4:$D$27,$G$4:$G$27,$J$4:$J$27,$P$4:$P$27,$S$4:$S$27)","v":0},{"$f":"ComputeOutgoingCost(P21,F58,'Link-Group'!$B$7:$G$7, $P$4:$P$27, $D$4:$D$27,$G$4:$G$27,$J$4:$J$27,$M$4:$M$27,$S$4:$S$27)","v":0},{"$f":"ComputeOutgoingCost(S21,G58,'Link-Group'!$B$7:$G$7, $S$4:$S$27, $D$4:$D$27,$G$4:$G$27,$J$4:$J$27,$M$4:$M$27,$P$4:$P$27)","v":0},null,18,{"$f":"ComputeIncomingCost(D21, B58,'Link-Group'!$B$11, 'Link-Group'!B$7, $B$41:$G$64, $D$4:$D$27, $G$4:$G$27,$J$4:$J$27,$M$4:$M$27,$P$4:$P$27,$S$4:$S$27)","v":0},{"$f":"ComputeIncomingCost(G21, C58,'Link-Group'!$B$11, 'Link-Group'!C$7, $B$41:$G$64, $G$4:$G$27, $D$4:$D$27,$J$4:$J$27,$M$4:$M$27,$P$4:$P$27,$S$4:$S$27)","v":0},{"$f":"ComputeIncomingCost(J21, D58,'Link-Group'!$B$11, 'Link-Group'!D$7, $B$41:$G$64, $J$4:$J$27, $D$4:$D$27,$G$4:$G$27,$M$4:$M$27,$P$4:$P$27,$S$4:$S$27)","v":0},{"$f":"ComputeIncomingCost(M21, E58,'Link-Group'!$B$11, 'Link-Group'!E$7, $B$41:$G$64, $M$4:$M$27, $D$4:$D$27,$G$4:$G$27,$J$4:$J$27,$P$4:$P$27,$S$4:$S$27)","v":0},{"$f":"ComputeIncomingCost(P21, F58,'Link-Group'!$B$11, 'Link-Group'!F$7, $B$41:$G$64, $P$4:$P$27, $D$4:$D$27,$G$4:$G$27,$J$4:$J$27,$M$4:$M$27,$S$4:$S$27)","v":0},{"$f":"ComputeIncomingCost(S21, G58,'Link-Group'!$B$11, 'Link-Group'!G$7, $B$41:$G$64, $S$4:$S$27, $D$4:$D$27,$G$4:$G$27,$J$4:$J$27,$M$4:$M$27,$P$4:$P$27)","v":0},null,18,{"$f":"ComputeInternalCost(D21, B58, 'Link-Group'!$B$11, $B$41:$G$64, $D$4:$D$27, $G$4:$G$27,$J$4:$J$27,$M$4:$M$27,$P$4:$P$27,$S$4:$S$27)","v":0},{"$f":"ComputeInternalCost(G21, C58, 'Link-Group'!$B$11, $B$41:$G$64, $G$4:$G$27, $D$4:$D$27,$J$4:$J$27,$M$4:$M$27,$P$4:$P$27,$S$4:$S$27)","v":0},{"$f":"ComputeInternalCost(J21, D58, 'Link-Group'!$B$11, $B$41:$G$64, $J$4:$J$27, $D$4:$D$27,$G$4:$G$27,$M$4:$M$27,$P$4:$P$27,$S$4:$S$27)","v":0},{"$f":"ComputeInternalCost(M21, E58, 'Link-Group'!$B$11, $B$41:$G$64, $M$4:$M$27, $D$4:$D$27,$G$4:$G$27,$J$4:$J$27,$P$4:$P$27,$S$4:$S$27)","v":0},{"$f":"ComputeInternalCost(P21, F58, 'Link-Group'!$B$11, $B$41:$G$64, $P$4:$P$27, $D$4:$D$27,$G$4:$G$27,$J$4:$J$27,$M$4:$M$27,$S$4:$S$27)","v":0},{"$f":"ComputeInternalCost(S21, G58, 'Link-Group'!$B$11, $B$41:$G$64, $S$4:$S$27, $D$4:$D$27,$G$4:$G$27,$J$4:$J$27,$M$4:$M$27,$P$4:$P$27)","v":0}]
[19,{"$f":"IF(AND(B22<>\"\", D22<>\"\"),VLOOKUP(C22,Weights!$G$2:$H$6,2, 0),0)","v":0},{"$f":"IF(AND(E22<>\"\", G22<>\"\"),VLOOKUP(F22,Weights!$G$2:$H$6,2, 0),0)","v":0},{"$f":"IF(AND(H22<>\"\", J22<>\"\"),VLOOKUP(I22,Weights!$G$2:$H$6,2, 0),0)","v":0},{"$f":"IF(AND(K22<>\"\", M22<>\"\"),VLOOKUP(L22,Weights!$G$2:$H$6,2, 0),0)","v":0},{"$f":"IF(AND(N22<>\"\", P22<>\"\"),VLOOKUP(O22,Weights!$G$2:$H$6,2, 0),0)","v":0},{"$f":"IF(AND(Q22<>\"\", S22<>\"\"),VLOOKUP(R22,Weights!$G$2:$H$6,2, 0),0)","v":0},null,19,{"$f":"ComputeOutgoingCost(D22,B59,'Link-Group'!$B$7:$G$7,$D$4:$D$27, $G$4:$G$27,$J$4:$J$27,$M$4:$M$27,$P$4:$P$27,$S$4:$S$27)","v":0},{"$f":"ComputeOutgoingCost(G22,C59,'Link-Group'!$B$7:$G$7,$G$4:$G$27, $D$4:$D$27,$J$4:$J$27,$M$4:$M$27,$P$4:$P$27,$S$4:$S$27)","v":0},{"$f":"ComputeOutgoingCost(J22,D59,'Link-Group'!$B$7:$G$7, $J$4:$J$27, $D$4:$D$27,$G$4:$G$27,$M$4:$M$27,$P$4:$P$27,$S$4:$S$27)","v":0},{"$f":"ComputeOutgoingCost(M22,E59,'Link-Group'!$B$7:$G$7,$M$4:$M$27, $D$4:$D$27,$G$4:$G$27,$J$4:$J$27,$P$4:$P$27,$S$4:$S$27)","v":0},{"$f":"ComputeOutgoingCost(P22,F59,'Link-Group'!$B$7:$G$7, $P$4:$P$27, $D$4:$D$27,$G$4:$G$27,$J$4:$J$27,$M$4:$M$27,$S$4:$S$27)","v":0},{"$f":"ComputeOutgoingCost(S22,G59,'Link-Group'!$B$7:$G$7, $S$4:$S$27, $D$4:$D$27,$G$4:$G$27,$J$4:$J$27,$M$4:$M$27,$P$4:$P$27)","v":0},null,19,{"$f":"ComputeIncomingCost(D22, B59,'Link-Group'!$B$11, 'Link-Group'!B$7, $B$41:$G$64, $D$4:$D$27, $G$4:$G$27,$J$4:$J$27,$M$4:$M$27,$P$4:$P$27,$S$4:$S$27)","v":0},{"$f":"ComputeIncomingCost(G22, C59,'Link-Group'!$B$11, 'Link-Group'!C$7, $B$41:$G$64, $G$4:$G$27, $D$4:$D$27,$J$4:$J$27,$M$4:$M$27,$P$4:$P$27,$S$4:$S$27)","v":0},{"$f":"ComputeIncomingCost(J22, D59,'Link-Group'!$B$11, 'Link-Group'!D$7, $B$41:$G$64, $J$4:$J$27, $D$4:$D$27,$G$4:$G$27,$M$4:$M$27,$P$4:$P$27,$S$4:$S$27)","v":0},{"$f":"ComputeIncomingCost(M22, E59,'Link-Group'!$B$11, 'Link-Group'!E$7, $B$41:$G$64, $M$4:$M$27, $D$4:$D$27,$G$4:$G$27,$J$4:$J$27,$P$4:$P$27,$S$4:$S$27)","v":0},{"$f":"ComputeIncomingCost(P22, F59,'Link-Group'!$B$11, 'Link-Group'!F$7, $B$41:$G$64, $P$4:$P$27, $D$4:$D$27,$G$4:$G$27,$J$4:$J$27,$M$4:$M$27,$S$4:$S$27)","v":0},{"$f":"ComputeIncomingCost(S22, G59,'Link-Group'!$B$11, 'Link-Group'!G$7, $B$41:$G$64, $S$4:$S$27, $D$4:$D$27,$G$4:$G$27,$J$4:$J$27,$M$4:$M$27,$P$4:$P$27)","v":0},null,19,{"$f":"ComputeInternalCost(D22, B59, 'Link-Group'!$B$11, $B$41:$G$64, $D$4:$D$27, $G$4:$G$27,$J$4:$J$27,$M$4:$M$27,$P$4:$P$27,$S$4:$S$27)","v":0},{"$f":"ComputeInternalCost(G22, C59, 'Link-Group'!$B$11, $B$41:$G$64, $G$4:$G$27, $D$4:$D$27,$J$4:$J$27,$M$4:$M$27,$P$4:$P$27,$S$4:$S$27)","v":0},{"$f":"ComputeInternalCost(J22, D59, 'Link-Group'!$B$11, $B$41:$G$64, $J$4:$J$27, $D$4:$D$27,$G$4:$G$27,$M$4:$M$27,$P$4:$P$27,$S$4:$S$27)","v":0},{"$f":"ComputeInternalCost(M22, E59, 'Link-Group'!$B$11, $B$41:$G$64, $M$4:$M$27, $D$4:$D$27,$G$4:$G$27,$J$4:$J$27,$P$4:$P$27,$S$4:$S$27)","v":0},{"$f":"ComputeInternalCost(P22, F59, 'Link-Group'!$B$11, $B$41:$G$64, $P$4:$P$27, $D$4:$D$27,$G$4:$G$27,$J$4:$J$27,$M$4:$M$27,$S$4:$S$27)","v":0},{"$f":"ComputeInternalCost(S22, G59, 'Link-Group'!$B$11, $B$41:$G$64, $S$4:$S$27, $D$4:$D$27,$G$4:$G$27,$J$4:$J$27,$M$4:$M$27,$P$4:$P$27)","v":0}]
[20,{"$f":"IF(AND(B23<>\"\", D23<>\"\"),VLOOKUP(C23,Weights!$G$2:$H$6,2, 0),0)","v":0},{"$f":"IF(AND(E23<>\"\", G23<>\"\"),VLOOKUP(F23,Weights!$G$2:$H$6,2, 0),0)","v":0},{"$f":"IF(AND(H23<>\"\", J23<>\"\"),VLOOKUP(I23,Weights!$G$2:$H$6,2, 0),0)","v":0},{"$f":"IF(AND(K23<>\"\", M23<>\"\"),VLOOKUP(L23,Weights!$G$2:$H$6,2, 0),0)","v":0},{"$f":"IF(AND(N23<>\"\", P23<>\"\"),VLOOKUP(O23,Weights!$G$2:$H$6,2, 0),0)","v":0},{"$f":"IF(AND(Q23<>\"\", S23<>\"\"),VLOOKUP(R23,Weights!$G$2:$H$6,2, 0),0)","v":0},null,20,{"$f":"ComputeOutgoingCost(D23,B60,'Link-Group'!$B$7:$G$7,$D$4:$D$27, $G$4:$G$27,$J$4:$J$27,$M$4:$M$27,$P$4:$P$27,$S$4:$S$27)","v":0},{"$f":"ComputeOutgoingCost(G23,C60,'Link-Group'!$B$7:$G$7,$G$4:$G$27, $D$4:$D$27,$J$4:$J$27,$M$4:$M$27,$P$4:$P$27,$S$4:$S$27)","v":0},{"$f":"ComputeOutgoingCost(J23,D60,'Link-Group'!$B$7:$G$7, $J$4:$J$27, $D$4:$D$27,$G$4:$G$27,$M$4:$M$27,$P$4:$P$27,$S$4:$S$27)","v":0},{"$f":"ComputeOutgoingCost(M23,E60,'Link-Group'!$B$7:$G$7,$M$4:$M$27, $D$4:$D$27,$G$4:$G$27,$J$4:$J$27,$P$4:$P$27,$S$4:$S$27)","v":0},{"$f":"ComputeOutgoingCost(P23,F60,'Link-Group'!$B$7:$G$7, $P$4:$P$27, $D$4:$D$27,$G$4:$G$27,$J$4:$J$27,$M$4:$M$27,$S$4:$S$27)","v":0},{"$f":"ComputeOutgoingCost(S23,G60,'Link-Group'!$B$7:$G$7, $S$4:$S$27, $D$4:$D$27,$G$4:$G$27,$J$4:$J$27,$M$4:$M$27,$P$4:$P$27)","v":0},null,20,{"$f":"ComputeIncomingCost(D23, B60,'Link-Group'!$B$11, 'Link-Group'!B$7, $B$41:$G$64, $D$4:$D$27, $G$4:$G$27,$J$4:$J$27,$M$4:$M$27,$P$4:$P$27,$S$4:$S$27)","v":0},{"$f":"ComputeIncomingCost(G23, C60,'Link-Group'!$B$11, 'Link-Group'!C$7, $B$41:$G$64, $G$4:$G$27, $D$4:$D$27,$J$4:$J$27,$M$4:$M$27,$P$4:$P$27,$S$4:$S$27)","v":0},{"$f":"ComputeIncomingCost(J23, D60,'Link-Group'!$B$11, 'Link-Group'!D$7, $B$41:$G$64, $J$4:$J$27, $D$4:$D$27,$G$4:$G$27,$M$4:$M$27,$P$4:$P$27,$S$4:$S$27)","v":0},{"$f":"ComputeIncomingCost(M23, E60,'Link-Group'!$B$11, 'Link-Group'!E$7, $B$41:$G$64, $M$4:$M$27, $D$4:$D$27,$G$4:$G$27,$J$4:$J$27,$P$4:$P$27,$S$4:$S$27)","v":0},{"$f":"ComputeIncomingCost(P23, F60,'Link-Group'!$B$11, 'Link-Group'!F$7, $B$41:$G$64, $P$4:$P$27, $D$4:$D$27,$G$4:$G$27,$J$4:$J$27,$M$4:$M$27,$S$4:$S$27)","v":0},{"$f":"ComputeIncomingCost(S23, G60,'Link-Group'!$B$11, 'Link-Group'!G$7, $B$41:$G$64, $S$4:$S$27, $D$4:$D$27,$G$4:$G$27,$J$4:$J$27,$M$4:$M$27,$P$4:$P$27)","v":0},null,20,{"$f":"ComputeInternalCost(D23, B60, 'Link-Group'!$B$11, $B$41:$G$64, $D$4:$D$27, $G$4:$G$27,$J$4:$J$27,$M$4:$M$27,$P$4:$P$27,$S$4:$S$27)","v":0},{"$f":"ComputeInternalCost(G23, C60, 'Link-Group'!$B$11, $B$41:$G$64, $G$4:$G$27, $D$4:$D$27,$J$4:$J$27,$M$4:$M$27,$P$4:$P$27,$S$4:$S$27)","v":0},{"$f":"ComputeInternalCost(J23, D60, 'Link-Group'!$B$11, $B$41:$G$64, $J$4:$J$27, $D$4:$D$27,$G$4:$G$27,$M$4:$M$27,$P$4:$P$27,$S$4:$S$27)","v":0},{"$f":"ComputeInternalCost(M23, E60, 'Link-Group'!$B$11, $B$41:$G$64, $M$4:$M$27, $D$4:$D$27,$G$4:$G$27,$J$4:$J$27,$P$4:$P$27,$S$4:$S$27)","v":0},{"$f":"ComputeInternalCost(P23, F60, 'Link-Group'!$B$11, $B$41:$G$64, $P$4:$P$27, $D$4:$D$27,$G$4:$G$27,$J$4:$J$27,$M$4:$M$27,$S$4:$S$27)","v":0},{"$f":"ComputeInternalCost(S23, G60, 'Link-Group'!$B$11, $B$41:$G$64, $S$4:$S$27, $D$4:$D$27,$G$4:$G$27,$J$4:$J$27,$M$4:$M$27,$P$4:$P$27)","v":0}]
[21,{"$f":"IF(AND(B24<>\"\", D24<>\"\"),VLOOKUP(C24,Weights!$G$2:$H$6,2, 0),0)","v":0},{"$f":"IF(AND(E24<>\"\", G24<>\"\"),VLOOKUP(F24,Weights!$G$2:$H$6,2, 0),0)","v":0},{"$f":"IF(AND(H24<>\"\", J24<>\"\"),VLOOKUP(I24,Weights!$G$2:$H$6,2, 0),0)","v":0},{"$f":"IF(AND(K24<>\"\", M24<>\"\"),VLOOKUP(L24,Weights!$G$2:$H$6,2, 0),0)","v":0},{"$f":"IF(AND(N24<>\"\", P24<>\"\"),VLOOKUP(O24,Weights!$G$2:$H$6,2, 0),0)","v":0},{"$f":"IF(AND(Q24<>\"\", S24<>\"\"),VLOOKUP(R24,Weights!$G$2:$H$6,2, 0),0)","v":0},null,21,{"$f":"ComputeOutgoingCost(D24,B61,'Link-Group'!$B$7:$G$7,$D$4:$D$27, $G$4:$G$27,$J$4:$J$27,$M$4:$M$27,$P$4:$P$27,$S$4:$S$27)","v":0},{"$f":"ComputeOutgoingCost(G24,C61,'Link-Group'!$B$7:$G$7,$G$4:$G$27, $D$4:$D$27,$J$4:$J$27,$M$4:$M$27,$P$4:$P$27,$S$4:$S$27)","v":0},{"$f":"ComputeOutgoingCost(J24,D61,'Link-Group'!$B$7:$G$7, $J$4:$J$27, $D$4:$D$27,$G$4:$G$27,$M$4:$M$27,$P$4:$P$27,$S$4:$S$27)","v":0},{"$f":"ComputeOutgoingCost(M24,E61,'Link-Group'!$B$7:$G$7,$M$4:$M$27, $D$4:$D$27,$G$4:$G$27,$J$4:$J$27,$P$4:$P$27,$S$4:$S$27)","v":0},{"$f":"ComputeOutgoingCost(P24,F61,'Link-Group'!$B$7:$G$7, $P$4:$P$27, $D$4:$D$27,$G$4:$G$27,$J$4:$J$27,$M$4:$M$27,$S$4:$S$27)","v":0},{"$f":"ComputeOutgoingCost(S24,G61,'Link-Group'!$B$7:$G$7, $S$4:$S$27, $D$4:$D$27,$G$4:$G$27,$J$4:$J$27,$M$4:$M$27,$P$4:$P$27)","v":0},null,21,{"$f":"ComputeIncomingCost(D24, B61,'Link-Group'!$B$11, 'Link-Group'!B$7, $B$41:$G$64, $D$4:$D$27, $G$4:$G$27,$J$4:$J$27,$M$4:$M$27,$P$4:$P$27,$S$4:$S$27)","v":0},{"$f":"ComputeIncomingCost(G24, C61,'Link-Group'!$B$11, 'Link-Group'!C$7, $B$41:$G$64, $G$4:$G$27, $D$4:$D$27,$J$4:$J$27,$M$4:$M$27,$P$4:$P$27,$S$4:$S$27)","v":0},{"$f":"ComputeIncomingCost(J24, D61,'Link-Group'!$B$11, 'Link-Group'!D$7, $B$41:$G$64, $J$4:$J$27, $D$4:$D$27,$G$4:$G$27,$M$4:$M$27,$P$4:$P$27,$S$4:$S$27)","v":0},{"$f":"ComputeIncomingCost(M24, E61,'Link-Group'!$B$11, 'Link-Group'!E$7, $B$41:$G$64, $M$4:$M$27, $D$4:$D$27,$G$4:$G$27,$J$4:$J$27,$P$4:$P$27,$S$4:$S$27)","v":0},{"$f":"ComputeIncomingCost(P24, F61,'Link-Group'!$B$11, 'Link-Group'!F$7, $B$41:$G$64, $P$4:$P$27, $D$4:$D$27,$G$4:$G$27,$J$4:$J$27,$M$4:$M$27,$S$4:$S$27)","v":0},{"$f":"ComputeIncomingCost(S24, G61,'Link-Group'!$B$11, 'Link-Group'!G$7, $B$41:$G$64, $S$4:$S$27, $D$4:$D$27,$G$4:$G$27,$J$4:$J$27,$M$4:$M$27,$P$4:$P$27)","v":0},null,21,{"$f":"ComputeInternalCost(D24, B61, 'Link-Group'!$B$11, $B$41:$G$64, $D$4:$D$27, $G$4:$G$27,$J$4:$J$27,$M$4:$M$27,$P$4:$P$27,$S$4:$S$27)","v":0},{"$f":"ComputeInternalCost(G24, C61, 'Link-Group'!$B$11, $B$41:$G$64, $G$4:$G$27, $D$4:$D$27,$J$4:$J$27,$M$4:$M$27,$P$4:$P$27,$S$4:$S$27)","v":0},{"$f":"ComputeInternalCost(J24, D61, 'Link-Group'!$B$11, $B$41:$G$64, $J$4:$J$27, $D$4:$D$27,$G$4:$G$27,$M$4:$M$27,$P$4:$P$27,$S$4:$S$27)","v":0},{"$f":"ComputeInternalCost(M24, E61, 'Link-Group'!$B$11, $B$41:$G$64, $M$4:$M$27, $D$4:$D$27,$G$4:$G$27,$J$4:$J$27,$P$4:$P$27,$S$4:$S$27)","v":0},{"$f":"ComputeInternalCost(P24, F61, 'Link-Group'!$B$11, $B$41:$G$64, $P$4:$P$27, $D$4:$D$27,$G$4:$G$27,$J$4:$J$27,$M$4:$M$27,$S$4:$S$27)","v":0},{"$f":"ComputeInternalCost(S24, G61, 'Link-Group'!$B$11, $B$41:$G$64, $S$4:$S$27, $D$4:$D$27,$G$4:$G$27,$J$4:$J$27,$M$4:$M$27,$P$4:$P$27)","v":0}]
[22,{"$f":"IF(AND(B25<>\"\", D25<>\"\"),VLOOKUP(C25,Weights!$G$2:$H$6,2, 0),0)","v":0},{"$f":"IF(AND(E25<>\"\", G25<>\"\"),VLOOKUP(F25,Weights!$G$2:$H$6,2, 0),0)","v":0},{"$f":"IF(AND(H25<>\"\", J25<>\"\"),VLOOKUP(I25,Weights!$G$2:$H$6,2, 0),0)","v":0},{"$f":"IF(AND(K25<>\"\", M25<>\"\"),VLOOKUP(L25,Weights!$G$2:$H$6,2, 0),0)","v":0},{"$f":"IF(AND(N25<>\"\", P25<>\"\"),VLOOKUP(O25,Weights!$G$2:$H$6,2, 0),0)","v":0},{"$f":"IF(AND(Q25<>\"\", S25<>\"\"),VLOOKUP(R25,Weights!$G$2:$H$6,2, 0),0)","v":0},null,22,{"$f":"ComputeOutgoingCost(D25,B62,'Link-Group'!$B$7:$G$7,$D$4:$D$27, $G$4:$G$27,$J$4:$J$27,$M$4:$M$27,$P$4:$P$27,$S$4:$S$27)","v":0},{"$f":"ComputeOutgoingCost(G25,C62,'Link-Group'!$B$7:$G$7,$G$4:$G$27, $D$4:$D$27,$J$4:$J$27,$M$4:$M$27,$P$4:$P$27,$S$4:$S$27)","v":0},{"$f":"ComputeOutgoingCost(J25,D62,'Link-Group'!$B$7:$G$7, $J$4:$J$27, $D$4:$D$27,$G$4:$G$27,$M$4:$M$27,$P$4:$P$27,$S$4:$S$27)","v":0},{"$f":"ComputeOutgoingCost(M25,E62,'Link-Group'!$B$7:$G$7,$M$4:$M$27, $D$4:$D$27,$G$4:$G$27,$J$4:$J$27,$P$4:$P$27,$S$4:$S$27)","v":0},{"$f":"ComputeOutgoingCost(P25,F62,'Link-Group'!$B$7:$G$7, $P$4:$P$27, $D$4:$D$27,$G$4:$G$27,$J$4:$J$27,$M$4:$M$27,$S$4:$S$27)","v":0},{"$f":"ComputeOutgoingCost(S25,G62,'Link-Group'!$B$7:$G$7, $S$4:$S$27, $D$4:$D$27,$G$4:$G$27,$J$4:$J$27,$M$4:$M$27,$P$4:$P$27)","v":0},null,22,{"$f":"ComputeIncomingCost(D25, B62,'Link-Group'!$B$11, 'Link-Group'!B$7, $B$41:$G$64, $D$4:$D$27, $G$4:$G$27,$J$4:$J$27,$M$4:$M$27,$P$4:$P$27,$S$4:$S$27)","v":0},{"$f":"ComputeIncomingCost(G25, C62,'Link-Group'!$B$11, 'Link-Group'!C$7, $B$41:$G$64, $G$4:$G$27, $D$4:$D$27,$J$4:$J$27,$M$4:$M$27,$P$4:$P$27,$S$4:$S$27)","v":0},{"$f":"ComputeIncomingCost(J25, D62,'Link-Group'!$B$11, 'Link-Group'!D$7, $B$41:$G$64, $J$4:$J$27, $D$4:$D$27,$G$4:$G$27,$M$4:$M$27,$P$4:$P$27,$S$4:$S$27)","v":0},{"$f":"ComputeIncomingCost(M25, E62,'Link-Group'!$B$11, 'Link-Group'!E$7, $B$41:$G$64, $M$4:$M$27, $D$4:$D$27,$G$4:$G$27,$J$4:$J$27,$P$4:$P$27,$S$4:$S$27)","v":0},{"$f":"ComputeIncomingCost(P25, F62,'Link-Group'!$B$11, 'Link-Group'!F$7, $B$41:$G$64, $P$4:$P$27, $D$4:$D$27,$G$4:$G$27,$J$4:$J$27,$M$4:$M$27,$S$4:$S$27)","v":0},{"$f":"ComputeIncomingCost(S25, G62,'Link-Group'!$B$11, 'Link-Group'!G$7, $B$41:$G$64, $S$4:$S$27, $D$4:$D$27,$G$4:$G$27,$J$4:$J$27,$M$4:$M$27,$P$4:$P$27)","v":0},null,22,{"$f":"ComputeInternalCost(D25, B62, 'Link-Group'!$B$11, $B$41:$G$64, $D$4:$D$27, $G$4:$G$27,$J$4:$J$27,$M$4:$M$27,$P$4:$P$27,$S$4:$S$27)","v":0},{"$f":"ComputeInternalCost(G25, C62, 'Link-Group'!$B$11, $B$41:$G$64, $G$4:$G$27, $D$4:$D$27,$J$4:$J$27,$M$4:$M$27,$P$4:$P$27,$S$4:$S$27)","v":0},{"$f":"ComputeInternalCost(J25, D62, 'Link-Group'!$B$11, $B$41:$G$64, $J$4:$J$27, $D$4:$D$27,$G$4:$G$27,$M$4:$M$27,$P$4:$P$27,$S$4:$S$27)","v":0},{"$f":"ComputeInternalCost(M25, E62, 'Link-Group'!$B$11, $B$41:$G$64, $M$4:$M$27, $D$4:$D$27,$G$4:$G$27,$J$4:$J$27,$P$4:$P$27,$S$4:$S$27)","v":0},{"$f":"ComputeInternalCost(P25, F62, 'Link-Group'!$B$11, $B$41:$G$64, $P$4:$P$27, $D$4:$D$27,$G$4:$G$27,$J$4:$J$27,$M$4:$M$27,$S$4:$S$27)","v":0},{"$f":"ComputeInternalCost(S25, G62, 'Link-Group'!$B$11, $B$41:$G$64, $S$4:$S$27, $D$4:$D$27,$G$4:$G$27,$J$4:$J$27,$M$4:$M$27,$P$4:$P$27)","v":0}]
[23,{"$f":"IF(AND(B26<>\"\", D26<>\"\"),VLOOKUP(C26,Weights!$G$2:$H$6,2, 0),0)","v":0},{"$f":"IF(AND(E26<>\"\", G26<>\"\"),VLOOKUP(F26,Weights!$G$2:$H$6,2, 0),0)","v":0},{"$f":"IF(AND(H26<>\"\", J26<>\"\"),VLOOKUP(I26,Weights!$G$2:$H$6,2, 0),0)","v":0},{"$f":"IF(AND(K26<>\"\", M26<>\"\"),VLOOKUP(L26,Weights!$G$2:$H$6,2, 0),0)","v":0},{"$f":"IF(AND(N26<>\"\", P26<>\"\"),VLOOKUP(O26,Weights!$G$2:$H$6,2, 0),0)","v":0},{"$f":"IF(AND(Q26<>\"\", S26<>\"\"),VLOOKUP(R26,Weights!$G$2:$H$6,2, 0),0)","v":0},null,23,{"$f":"ComputeOutgoingCost(D26,B63,'Link-Group'!$B$7:$G$7,$D$4:$D$27, $G$4:$G$27,$J$4:$J$27,$M$4:$M$27,$P$4:$P$27,$S$4:$S$27)","v":0},{"$f":"ComputeOutgoingCost(G26,C63,'Link-Group'!$B$7:$G$7,$G$4:$G$27, $D$4:$D$27,$J$4:$J$27,$M$4:$M$27,$P$4:$P$27,$S$4:$S$27)","v":0},{"$f":"ComputeOutgoingCost(J26,D63,'Link-Group'!$B$7:$G$7, $J$4:$J$27, $D$4:$D$27,$G$4:$G$27,$M$4:$M$27,$P$4:$P$27,$S$4:$S$27)","v":0},{"$f":"ComputeOutgoingCost(M26,E63,'Link-Group'!$B$7:$G$7,$M$4:$M$27, $D$4:$D$27,$G$4:$G$27,$J$4:$J$27,$P$4:$P$27,$S$4:$S$27)","v":0},{"$f":"ComputeOutgoingCost(P26,F63,'Link-Group'!$B$7:$G$7, $P$4:$P$27, $D$4:$D$27,$G$4:$G$27,$J$4:$J$27,$M$4:$M$27,$S$4:$S$27)","v":0},{"$f":"ComputeOutgoingCost(S26,G63,'Link-Group'!$B$7:$G$7, $S$4:$S$27, $D$4:$D$27,$G$4:$G$27,$J$4:$J$27,$M$4:$M$27,$P$4:$P$27)","v":0},null,23,{"$f":"ComputeIncomingCost(D26, B63,'Link-Group'!$B$11, 'Link-Group'!B$7, $B$41:$G$64, $D$4:$D$27, $G$4:$G$27,$J$4:$J$27,$M$4:$M$27,$P$4:$P$27,$S$4:$S$27)","v":0},{"$f":"ComputeIncomingCost(G26, C63,'Link-Group'!$B$11, 'Link-Group'!C$7, $B$41:$G$64, $G$4:$G$27, $D$4:$D$27,$J$4:$J$27,$M$4:$M$27,$P$4:$P$27,$S$4:$S$27)","v":0},{"$f":"ComputeIncomingCost(J26, D63,'Link-Group'!$B$11, 'Link-Group'!D$7, $B$41:$G$64, $J$4:$J$27, $D$4:$D$27,$G$4:$G$27,$M$4:$M$27,$P$4:$P$27,$S$4:$S$27)","v":0},{"$f":"ComputeIncomingCost(M26, E63,'Link-Group'!$B$11, 'Link-Group'!E$7, $B$41:$G$64, $M$4:$M$27, $D$4:$D$27,$G$4:$G$27,$J$4:$J$27,$P$4:$P$27,$S$4:$S$27)","v":0},{"$f":"ComputeIncomingCost(P26, F63,'Link-Group'!$B$11, 'Link-Group'!F$7, $B$41:$G$64, $P$4:$P$27, $D$4:$D$27,$G$4:$G$27,$J$4:$J$27,$M$4:$M$27,$S$4:$S$27)","v":0},{"$f":"ComputeIncomingCost(S26, G63,'Link-Group'!$B$11, 'Link-Group'!G$7, $B$41:$G$64, $S$4:$S$27, $D$4:$D$27,$G$4:$G$27,$J$4:$J$27,$M$4:$M$27,$P$4:$P$27)","v":0},null,23,{"$f":"ComputeInternalCost(D26, B63, 'Link-Group'!$B$11, $B$41:$G$64, $D$4:$D$27, $G$4:$G$27,$J$4:$J$27,$M$4:$M$27,$P$4:$P$27,$S$4:$S$27)","v":0},{"$f":"ComputeInternalCost(G26, C63, 'Link-Group'!$B$11, $B$41:$G$64, $G$4:$G$27, $D$4:$D$27,$J$4:$J$27,$M$4:$M$27,$P$4:$P$27,$S$4:$S$27)","v":0},{"$f":"ComputeInternalCost(J26, D63, 'Link-Group'!$B$11, $B$41:$G$64, $J$4:$J$27, $D$4:$D$27,$G$4:$G$27,$M$4:$M$27,$P$4:$P$27,$S$4:$S$27)","v":0},{"$f":"ComputeInternalCost(M26, E63, 'Link-Group'!$B$11, $B$41:$G$64, $M$4:$M$27, $D$4:$D$27,$G$4:$G$27,$J$4:$J$27,$P$4:$P$27,$S$4:$S$27)","v":0},{"$f":"ComputeInternalCost(P26, F63, 'Link-Group'!$B$11, $B$41:$G$64, $P$4:$P$27, $D$4:$D$27,$G$4:$G$27,$J$4:$J$27,$M$4:$M$27,$S$4:$S$27)","v":0},{"$f":"ComputeInternalCost(S26, G63, 'Link-Group'!$B$11, $B$41:$G$64, $S$4:$S$27, $D$4:$D$27,$G$4:$G$27,$J$4:$J$27,$M$4:$M$27,$P$4:$P$27)","v":0}]
[24,{"$f":"IF(AND(B27<>\"\", D27<>\"\"),VLOOKUP(C27,Weights!$G$2:$H$6,2, 0),0)","v":0},{"$f":"IF(AND(E27<>\"\", G27<>\"\"),VLOOKUP(F27,Weights!$G$2:$H$6,2, 0),0)","v":0},{"$f":"IF(AND(H27<>\"\", J27<>\"\"),VLOOKUP(I27,Weights!$G$2:$H$6,2, 0),0)","v":0},{"$f":"IF(AND(K27<>\"\", M27<>\"\"),VLOOKUP(L27,Weights!$G$2:$H$6,2, 0),0)","v":0},{"$f":"IF(AND(N27<>\"\", P27<>\"\"),VLOOKUP(O27,Weights!$G$2:$H$6,2, 0),0)","v":0},{"$f":"IF(AND(Q27<>\"\", S27<>\"\"),VLOOKUP(R27,Weights!$G$2:$H$6,2, 0),0)","v":0},null,24,{"$f":"ComputeOutgoingCost(D27,B64,'Link-Group'!$B$7:$G$7,$D$4:$D$27, $G$4:$G$27,$J$4:$J$27,$M$4:$M$27,$P$4:$P$27,$S$4:$S$27)","v":0},{"$f":"ComputeOutgoingCost(G27,C64,'Link-Group'!$B$7:$G$7,$G$4:$G$27, $D$4:$D$27,$J$4:$J$27,$M$4:$M$27,$P$4:$P$27,$S$4:$S$27)","v":0},{"$f":"ComputeOutgoingCost(J27,D64,'Link-Group'!$B$7:$G$7, $J$4:$J$27, $D$4:$D$27,$G$4:$G$27,$M$4:$M$27,$P$4:$P$27,$S$4:$S$27)","v":0},{"$f":"ComputeOutgoingCost(M27,E64,'Link-Group'!$B$7:$G$7,$M$4:$M$27, $D$4:$D$27,$G$4:$G$27,$J$4:$J$27,$P$4:$P$27,$S$4:$S$27)","v":0},{"$f":"ComputeOutgoingCost(P27,F64,'Link-Group'!$B$7:$G$7, $P$4:$P$27, $D$4:$D$27,$G$4:$G$27,$J$4:$J$27,$M$4:$M$27,$S$4:$S$27)","v":0},{"$f":"ComputeOutgoingCost(S27,G64,'Link-Group'!$B$7:$G$7, $S$4:$S$27, $D$4:$D$27,$G$4:$G$27,$J$4:$J$27,$M$4:$M$27,$P$4:$P$27)","v":0},null,24,{"$f":"ComputeIncomingCost(D27, B64,'Link-Group'!$B$11, 'Link-Group'!B$7, $B$41:$G$64, $D$4:$D$27, $G$4:$G$27,$J$4:$J$27,$M$4:$M$27,$P$4:$P$27,$S$4:$S$27)","v":0},{"$f":"ComputeIncomingCost(G27, C64,'Link-Group'!$B$11, 'Link-Group'!C$7, $B$41:$G$64, $G$4:$G$27, $D$4:$D$27,$J$4:$J$27,$M$4:$M$27,$P$4:$P$27,$S$4:$S$27)","v":0},{"$f":"ComputeIncomingCost(J27, D64,'Link-Group'!$B$11, 'Link-Group'!D$7, $B$41:$G$64, $J$4:$J$27, $D$4:$D$27,$G$4:$G$27,$M$4:$M$27,$P$4:$P$27,$S$4:$S$27)","v":0},{"$f":"ComputeIncomingCost(M27, E64,'Link-Group'!$B$11, 'Link-Group'!E$7, $B$41:$G$64, $M$4:$M$27, $D$4:$D$27,$G$4:$G$27,$J$4:$J$27,$P$4:$P$27,$S$4:$S$27)","v":0},{"$f":"ComputeIncomingCost(P27, F64,'Link-Group'!$B$11, 'Link-Group'!F$7, $B$41:$G$64, $P$4:$P$27, $D$4:$D$27,$G$4:$G$27,$J$4:$J$27,$M$4:$M$27,$S$4:$S$27)","v":0},{"$f":"ComputeIncomingCost(S27, G64,'Link-Group'!$B$11, 'Link-Group'!G$7, $B$41:$G$64, $S$4:$S$27, $D$4:$D$27,$G$4:$G$27,$J$4:$J$27,$M$4:$M$27,$P$4:$P$27)","v":0},null,24,{"$f":"ComputeInternalCost(D27, B64, 'Link-Group'!$B$11, $B$41:$G$64, $D$4:$D$27, $G$4:$G$27,$J$4:$J$27,$M$4:$M$27,$P$4:$P$27,$S$4:$S$27)","v":0},{"$f":"ComputeInternalCost(G27, C64, 'Link-Group'!$B$11, $B$41:$G$64, $G$4:$G$27, $D$4:$D$27,$J$4:$J$27,$M$4:$M$27,$P$4:$P$27,$S$4:$S$27)","v":0},{"$f":"ComputeInternalCost(J27, D64, 'Link-Group'!$B$11, $B$41:$G$64, $J$4:$J$27, $D$4:$D$27,$G$4:$G$27,$M$4:$M$27,$P$4:$P$27,$S$4:$S$27)","v":0},{"$f":"ComputeInternalCost(M27, E64, 'Link-Group'!$B$11, $B$41:$G$64, $M$4:$M$27, $D$4:$D$27,$G$4:$G$27,$J$4:$J$27,$P$4:$P$27,$S$4:$S$27)","v":0},{"$f":"ComputeInternalCost(P27, F64, 'Link-Group'!$B$11, $B$41:$G$64, $P$4:$P$27, $D$4:$D$27,$G$4:$G$27,$J$4:$J$27,$M$4:$M$27,$S$4:$S$27)","v":0},{"$f":"ComputeInternalCost(S27, G64, 'Link-Group'!$B$11, $B$41:$G$64, $S$4:$S$27, $D$4:$D$27,$G$4:$G$27,$J$4:$J$27,$M$4:$M$27,$P$4:$P$27)","v":0}]
[null,null,null,null,null,null,null,null,"Total",{"$f":"SUM(J41:J64)","v":0},{"$f":"SUM(K41:K64)","v":0},0,0,0,0,null,"Total",{"$f":"SUM(R41:R64)","v":0},{"$f":"SUM(S41:S64)","v":0},0,0,0,0,null,"Total",{"$f":"SUM(Z41:Z64)","v":0},{"$f":"SUM(AA41:AA64)","v":0},0,0,0,0]

{"sheet":"Weights","index":2,"n_rows":9,"n_cols":8,"rows_kept":9,"cut":false,"hidden":false,"merged":[]}
["Max Usage",74,null,"Link-Group Type","Cost",null,"Network Quality","Cost"]
["Usage Red Threshold",64,null,"Internet/NATed",1.3,null,"Very Low",0.1]
["Usage Yellow Threshold",60,null,"WAN/LAN",0.8,null,"Low",0.2]
[null,null,null,null,null,null,"Balanced",0.5]
["SIP Cost",5,null,null,null,null,"High",1.1000000000000001]
["IVC Cost",4.5,null,null,null,null,"Very High",2.2000000000000002]
["Local Virtual Client Cost",1.1000000000000001]
["Virtual Client Routing (out)",0.4]
["Virtual Client Routing (in)",0.4]